BDBM50257616 4-(2,3,4,5-tetrahydro-1H-benzo[d]azepin-7-ylsulfonyl)morpholine::CHEMBL492357
SMILES: O=S(=O)(N1CCOCC1)c1ccc2CCNCCc2c1
InChI Key: InChIKey=JBRSFEIYDIXRQO-UHFFFAOYSA-N
Data: 1 KI  1 EC50
Activity Spreadsheet -- Enzyme Inhibition Constant Data from BindingDB
Found 2 hits for monomerid = 50257616
Trg + Lig
Ki
nM
ΔG°
kcal/mole
IC50
nM
Kd
nM
EC50/IC50
nM
koff
s-1
kon
M-1s-1
pHTemp
°C
5-hydroxytryptamine receptor 2C
(Homo sapiens (Human))
BDBM50257616
(4-(2,3,4,5-tetrahydro-1H-benzo[d]azepin-7-ylsulfon...)
Show SMILES O=S(=O)(N1CCOCC1)c1ccc2CCNCCc2c1
Show InChI InChI=1S/C14H20N2O3S/c17-20(18,16-7-9-19-10-8-16)14-2-1-12-3-5-15-6-4-13(12)11-14/h1-2,11,15H,3-10H2
Reactome pathway
196n/an/an/an/an/an/an/an/a
Pfizer Global Research and Development
Curated by ChEMBL
Assay Description
Displacement of [3H]mesulergine form human recombinant 5HT2C receptor expressed in mouse Swiss 3T3 cells by scintillation proximity assay
Bioorg Med Chem Lett 19: 1871-5 (2009)
Article DOI: 10.1016/j.bmcl.2009.02.071
BindingDB Entry DOI: 10.7270/Q2GB23XH
5-hydroxytryptamine receptor 2C
(Homo sapiens (Human))
BDBM50257616
(4-(2,3,4,5-tetrahydro-1H-benzo[d]azepin-7-ylsulfon...)
Show SMILES O=S(=O)(N1CCOCC1)c1ccc2CCNCCc2c1
Show InChI InChI=1S/C14H20N2O3S/c17-20(18,16-7-9-19-10-8-16)14-2-1-12-3-5-15-6-4-13(12)11-14/h1-2,11,15H,3-10H2
Reactome pathway
n/an/an/an/a 186n/an/an/an/a
Pfizer Global Research and Development
Curated by ChEMBL
Assay Description
Agonist activity at human recombinant 5HT2C receptor expressed in CHOK1 cells assessed as calcium mobilization by FLIPR assay
Bioorg Med Chem Lett 19: 1871-5 (2009)
Article DOI: 10.1016/j.bmcl.2009.02.071
BindingDB Entry DOI: 10.7270/Q2GB23XH