BDBM50257618 (S)-7-(3-(2-chlorophenoxy)pyrrolidin-1-ylsulfonyl)-2,3,4,5-tetrahydro-1H-benzo[d]azepine::CHEMBL492557
SMILES: Clc1ccccc1O[C@H]1CCN(C1)S(=O)(=O)c1ccc2CCNCCc2c1
InChI Key: InChIKey=ZKXGFMNPUCAFKG-KRWDZBQOSA-N
Data: 1 KI  2 EC50
Activity Spreadsheet -- Enzyme Inhibition Constant Data from BindingDB
Found 3 hits for monomerid = 50257618
Trg + Lig
Ki
nM
ΔG°
kcal/mole
IC50
nM
Kd
nM
EC50/IC50
nM
koff
s-1
kon
M-1s-1
pHTemp
°C
Potassium voltage-gated channel subfamily H member 2
(Homo sapiens (Human))
BDBM50257618
((S)-7-(3-(2-chlorophenoxy)pyrrolidin-1-ylsulfonyl)...)
Show SMILES Clc1ccccc1O[C@H]1CCN(C1)S(=O)(=O)c1ccc2CCNCCc2c1 |r|
Show InChI InChI=1S/C20H23ClN2O3S/c21-19-3-1-2-4-20(19)26-17-9-12-23(14-17)27(24,25)18-6-5-15-7-10-22-11-8-16(15)13-18/h1-6,13,17,22H,7-12,14H2/t17-/m0/s1
Reactome pathway
5.24E+3n/an/an/an/an/an/an/an/a
Pfizer Global Research and Development
Curated by ChEMBL
Assay Description
Binding affinity to human ERG
Bioorg Med Chem Lett 19: 1871-5 (2009)
Article DOI: 10.1016/j.bmcl.2009.02.071
BindingDB Entry DOI: 10.7270/Q2GB23XH
5-hydroxytryptamine receptor 2B
(Homo sapiens (Human))
BDBM50257618
((S)-7-(3-(2-chlorophenoxy)pyrrolidin-1-ylsulfonyl)...)
Show SMILES Clc1ccccc1O[C@H]1CCN(C1)S(=O)(=O)c1ccc2CCNCCc2c1 |r|
Show InChI InChI=1S/C20H23ClN2O3S/c21-19-3-1-2-4-20(19)26-17-9-12-23(14-17)27(24,25)18-6-5-15-7-10-22-11-8-16(15)13-18/h1-6,13,17,22H,7-12,14H2/t17-/m0/s1
Reactome pathway
n/an/an/an/a>9.94E+3n/an/an/an/a
Pfizer Global Research and Development
Curated by ChEMBL
Assay Description
Agonist activity at human recombinant 5HT2B receptor by cell-based system
Bioorg Med Chem Lett 19: 1871-5 (2009)
Article DOI: 10.1016/j.bmcl.2009.02.071
BindingDB Entry DOI: 10.7270/Q2GB23XH
5-hydroxytryptamine receptor 2C
(Homo sapiens (Human))
BDBM50257618
((S)-7-(3-(2-chlorophenoxy)pyrrolidin-1-ylsulfonyl)...)
Show SMILES Clc1ccccc1O[C@H]1CCN(C1)S(=O)(=O)c1ccc2CCNCCc2c1 |r|
Show InChI InChI=1S/C20H23ClN2O3S/c21-19-3-1-2-4-20(19)26-17-9-12-23(14-17)27(24,25)18-6-5-15-7-10-22-11-8-16(15)13-18/h1-6,13,17,22H,7-12,14H2/t17-/m0/s1
Reactome pathway
n/an/an/an/a 31n/an/an/an/a
Pfizer Global Research and Development
Curated by ChEMBL
Assay Description
Agonist activity at human recombinant 5HT2C receptor expressed in CHOK1 cells assessed as calcium mobilization by FLIPR assay
Bioorg Med Chem Lett 19: 1871-5 (2009)
Article DOI: 10.1016/j.bmcl.2009.02.071
BindingDB Entry DOI: 10.7270/Q2GB23XH