BDBM50257627 7-(4-fluorophenylsulfonyl)-2,3,4,5-tetrahydro-1H-benzo[d]azepine::CHEMBL492911
SMILES: Fc1ccc(cc1)S(=O)(=O)c1ccc2CCNCCc2c1
InChI Key: InChIKey=JZGBLZRMUKFLDN-UHFFFAOYSA-N
Data: 2 EC50
Activity Spreadsheet -- Enzyme Inhibition Constant Data from BindingDB
Found 2 hits for monomerid = 50257627
Trg + Lig
Ki
nM
ΔG°
kcal/mole
IC50
nM
Kd
nM
EC50/IC50
nM
koff
s-1
kon
M-1s-1
pHTemp
°C
5-hydroxytryptamine receptor 2C
(Homo sapiens (Human))
BDBM50257627
(7-(4-fluorophenylsulfonyl)-2,3,4,5-tetrahydro-1H-b...)
Show SMILES Fc1ccc(cc1)S(=O)(=O)c1ccc2CCNCCc2c1
Show InChI InChI=1S/C16H16FNO2S/c17-14-2-5-15(6-3-14)21(19,20)16-4-1-12-7-9-18-10-8-13(12)11-16/h1-6,11,18H,7-10H2
Reactome pathway
n/an/an/an/a 80n/an/an/an/a
Pfizer Global Research and Development
Curated by ChEMBL
Assay Description
Agonist activity at human recombinant 5HT2C receptor expressed in CHOK1 cells assessed as calcium mobilization by FLIPR assay
Bioorg Med Chem Lett 19: 1871-5 (2009)
Article DOI: 10.1016/j.bmcl.2009.02.071
BindingDB Entry DOI: 10.7270/Q2GB23XH
5-hydroxytryptamine receptor 2B
(Homo sapiens (Human))
BDBM50257627
(7-(4-fluorophenylsulfonyl)-2,3,4,5-tetrahydro-1H-b...)
Show SMILES Fc1ccc(cc1)S(=O)(=O)c1ccc2CCNCCc2c1
Show InChI InChI=1S/C16H16FNO2S/c17-14-2-5-15(6-3-14)21(19,20)16-4-1-12-7-9-18-10-8-13(12)11-16/h1-6,11,18H,7-10H2
Reactome pathway
n/an/an/an/a 15n/an/an/an/a
Pfizer Global Research and Development
Curated by ChEMBL
Assay Description
Agonist activity at human recombinant 5HT2B receptor by cell-based system
Bioorg Med Chem Lett 19: 1871-5 (2009)
Article DOI: 10.1016/j.bmcl.2009.02.071
BindingDB Entry DOI: 10.7270/Q2GB23XH