null
SMILES: COc1cccc(c1)C(=O)N(C1CCN(CC1)c1cc(N)ccn1)c1ccccn1
InChI Key: InChIKey=SXNZZOLRRULMMG-UHFFFAOYSA-N
Activity Spreadsheet -- Enzyme Inhibition Constant Data from BindingDB
Found 2 hits for monomerid = 50257784
Trg + Lig
Ki
nM
ΔG°
kcal/mole
IC50
nM
Kd
nM
EC50/IC50
nM
koff
s-1
kon
M-1s-1
pHTemp
°C
Potassium voltage-gated channel subfamily H member 2
(Homo sapiens (Human))
BDBM50257784
(CHEMBL493517 | N-(1-(4-aminopyridin-2-yl)piperidin...)
Show SMILES COc1cccc(c1)C(=O)N(C1CCN(CC1)c1cc(N)ccn1)c1ccccn1
Show InChI InChI=1S/C23H25N5O2/c1-30-20-6-4-5-17(15-20)23(29)28(21-7-2-3-11-25-21)19-9-13-27(14-10-19)22-16-18(24)8-12-26-22/h2-8,11-12,15-16,19H,9-10,13-14H2,1H3,(H2,24,26)
Reactome pathway
9.69E+3n/an/an/an/an/an/an/an/a
Pfizer Global Research and Development
Curated by ChEMBL
Assay Description
Inhibition of human ERG
Bioorg Med Chem Lett 19: 1702-6 (2009)
Article DOI: 10.1016/j.bmcl.2009.01.106
BindingDB Entry DOI: 10.7270/Q21G0M40
Delta-type opioid receptor
(Homo sapiens (Human))
BDBM50257784
(CHEMBL493517 | N-(1-(4-aminopyridin-2-yl)piperidin...)
Show SMILES COc1cccc(c1)C(=O)N(C1CCN(CC1)c1cc(N)ccn1)c1ccccn1
Show InChI InChI=1S/C23H25N5O2/c1-30-20-6-4-5-17(15-20)23(29)28(21-7-2-3-11-25-21)19-9-13-27(14-10-19)22-16-18(24)8-12-26-22/h2-8,11-12,15-16,19H,9-10,13-14H2,1H3,(H2,24,26)
Reactome pathway
n/an/an/an/a 52n/an/an/an/a
Pfizer Global Research and Development
Curated by ChEMBL
Assay Description
Agonist activity at delta opioid receptor expressed in CHO cells assessed as inhibition of forskolin-stimulated cAMP production by ALPHAscreen assay
Bioorg Med Chem Lett 19: 1702-6 (2009)
Article DOI: 10.1016/j.bmcl.2009.01.106
BindingDB Entry DOI: 10.7270/Q21G0M40