null
SMILES: COc1ccc(cc1)-n1c2cccnc2n(C2CCN(CC2)c2cc(N)ccn2)c1=O
InChI Key: InChIKey=NIOUSQZJYWLFCC-UHFFFAOYSA-N
Activity Spreadsheet -- Enzyme Inhibition Constant Data from BindingDB
Found 2 hits for monomerid = 50257831
Trg + Lig
Ki
nM
ΔG°
kcal/mole
IC50
nM
Kd
nM
EC50/IC50
nM
koff
s-1
kon
M-1s-1
pHTemp
°C
Potassium voltage-gated channel subfamily H member 2
(Homo sapiens (Human))
BDBM50257831
(3-(1-(4-aminopyridin-2-yl)piperidin-4-yl)-1-(4-met...)
Show SMILES COc1ccc(cc1)-n1c2cccnc2n(C2CCN(CC2)c2cc(N)ccn2)c1=O
Show InChI InChI=1S/C23H24N6O2/c1-31-19-6-4-17(5-7-19)28-20-3-2-11-26-22(20)29(23(28)30)18-9-13-27(14-10-18)21-15-16(24)8-12-25-21/h2-8,11-12,15,18H,9-10,13-14H2,1H3,(H2,24,25)
Reactome pathway
865n/an/an/an/an/an/an/an/a
Pfizer Global Research and Development
Curated by ChEMBL
Assay Description
Inhibition of human ERG
Bioorg Med Chem Lett 19: 1702-6 (2009)
Article DOI: 10.1016/j.bmcl.2009.01.106
BindingDB Entry DOI: 10.7270/Q21G0M40
Delta-type opioid receptor
(Homo sapiens (Human))
BDBM50257831
(3-(1-(4-aminopyridin-2-yl)piperidin-4-yl)-1-(4-met...)
Show SMILES COc1ccc(cc1)-n1c2cccnc2n(C2CCN(CC2)c2cc(N)ccn2)c1=O
Show InChI InChI=1S/C23H24N6O2/c1-31-19-6-4-17(5-7-19)28-20-3-2-11-26-22(20)29(23(28)30)18-9-13-27(14-10-18)21-15-16(24)8-12-25-21/h2-8,11-12,15,18H,9-10,13-14H2,1H3,(H2,24,25)
Reactome pathway
n/an/an/an/a 3n/an/an/an/a
Pfizer Global Research and Development
Curated by ChEMBL
Assay Description
Agonist activity at delta opioid receptor expressed in CHO cells assessed as inhibition of forskolin-stimulated cAMP production by ALPHAscreen assay
Bioorg Med Chem Lett 19: 1702-6 (2009)
Article DOI: 10.1016/j.bmcl.2009.01.106
BindingDB Entry DOI: 10.7270/Q21G0M40