BDBM50257834 3-(1-(4-aminopyridin-2-yl)piperidin-4-yl)-1-(cyclopropylmethyl)-1H-imidazo[4,5-b]pyridin-2(3H)-one::CHEMBL523504
SMILES: Nc1ccnc(c1)N1CCC(CC1)n1c2ncccc2n(CC2CC2)c1=O
InChI Key: InChIKey=RIPIWVOJURKQMI-UHFFFAOYSA-N
Data: 1 KI  1 EC50
Activity Spreadsheet -- Enzyme Inhibition Constant Data from BindingDB
Found 2 hits for monomerid = 50257834
Trg + Lig
Ki
nM
ΔG°
kcal/mole
IC50
nM
Kd
nM
EC50/IC50
nM
koff
s-1
kon
M-1s-1
pHTemp
°C
Potassium voltage-gated channel subfamily H member 2
(Homo sapiens (Human))
BDBM50257834
(3-(1-(4-aminopyridin-2-yl)piperidin-4-yl)-1-(cyclo...)
Show SMILES Nc1ccnc(c1)N1CCC(CC1)n1c2ncccc2n(CC2CC2)c1=O
Show InChI InChI=1S/C20H24N6O/c21-15-5-9-22-18(12-15)24-10-6-16(7-11-24)26-19-17(2-1-8-23-19)25(20(26)27)13-14-3-4-14/h1-2,5,8-9,12,14,16H,3-4,6-7,10-11,13H2,(H2,21,22)
Reactome pathway
746n/an/an/an/an/an/an/an/a
Pfizer Global Research and Development
Curated by ChEMBL
Assay Description
Inhibition of human ERG
Bioorg Med Chem Lett 19: 1702-6 (2009)
Article DOI: 10.1016/j.bmcl.2009.01.106
BindingDB Entry DOI: 10.7270/Q21G0M40
Delta-type opioid receptor
(Homo sapiens (Human))
BDBM50257834
(3-(1-(4-aminopyridin-2-yl)piperidin-4-yl)-1-(cyclo...)
Show SMILES Nc1ccnc(c1)N1CCC(CC1)n1c2ncccc2n(CC2CC2)c1=O
Show InChI InChI=1S/C20H24N6O/c21-15-5-9-22-18(12-15)24-10-6-16(7-11-24)26-19-17(2-1-8-23-19)25(20(26)27)13-14-3-4-14/h1-2,5,8-9,12,14,16H,3-4,6-7,10-11,13H2,(H2,21,22)
Reactome pathway
n/an/an/an/a 41n/an/an/an/a
Pfizer Global Research and Development
Curated by ChEMBL
Assay Description
Agonist activity at delta opioid receptor expressed in CHO cells assessed as inhibition of forskolin-stimulated cAMP production by ALPHAscreen assay
Bioorg Med Chem Lett 19: 1702-6 (2009)
Article DOI: 10.1016/j.bmcl.2009.01.106
BindingDB Entry DOI: 10.7270/Q21G0M40