null
SMILES: CC(C)[C@@]1(CC[C@H](C1)NC1CCSCC1)C(=O)NCc1cc(cc(c1)C(F)(F)F)C(F)(F)F
InChI Key: InChIKey=NKLAOPBORRSLGF-CTNGQTDRSA-N
Activity Spreadsheet -- Enzyme Inhibition Constant Data from BindingDB
Found 3 hits for monomerid = 50257900
Trg + Lig
Ki
nM
ΔG°
kcal/mole
IC50
nM
Kd
nM
EC50/IC50
nM
koff
s-1
kon
M-1s-1
pHTemp
°C
C-C motif chemokine 2
(Homo sapiens (Human))
BDBM50257900
((1S,3R)-N-(3,5-bis(trifluoromethyl)benzyl)-1-isopr...)
Show SMILES CC(C)[C@@]1(CC[C@H](C1)NC1CCSCC1)C(=O)NCc1cc(cc(c1)C(F)(F)F)C(F)(F)F |r|
Show InChI InChI=1S/C23H30F6N2OS/c1-14(2)21(6-3-19(12-21)31-18-4-7-33-8-5-18)20(32)30-13-15-9-16(22(24,25)26)11-17(10-15)23(27,28)29/h9-11,14,18-19,31H,3-8,12-13H2,1-2H3,(H,30,32)/t19-,21+/m1/s1
Reactome pathway
31n/an/an/an/an/an/an/an/a
Leiden University
Curated by ChEMBL
Assay Description
Displacement of [125I]-CCL2 from human CCR2 receptor expressed in human U2OS cell membranes
J Med Chem 56: 7706-14 (2013)
Article DOI: 10.1021/jm4011737
BindingDB Entry DOI: 10.7270/Q2FT8NG3
C-C chemokine receptor type 2
(Homo sapiens (Human))
BDBM50257900
((1S,3R)-N-(3,5-bis(trifluoromethyl)benzyl)-1-isopr...)
Show SMILES CC(C)[C@@]1(CC[C@H](C1)NC1CCSCC1)C(=O)NCc1cc(cc(c1)C(F)(F)F)C(F)(F)F |r|
Show InChI InChI=1S/C23H30F6N2OS/c1-14(2)21(6-3-19(12-21)31-18-4-7-33-8-5-18)20(32)30-13-15-9-16(22(24,25)26)11-17(10-15)23(27,28)29/h9-11,14,18-19,31H,3-8,12-13H2,1-2H3,(H,30,32)/t19-,21+/m1/s1
n/an/a 36n/an/an/an/an/an/a
TBA
Assay Description
Antagonist activity at CCR2 (unknown origin)
Citation and Details
Article DOI: 10.1007/s00044-010-9501-4
BindingDB Entry DOI: 10.7270/Q20R9S95
C-C chemokine receptor type 2
(Homo sapiens (Human))
BDBM50257900
((1S,3R)-N-(3,5-bis(trifluoromethyl)benzyl)-1-isopr...)
Show SMILES CC(C)[C@@]1(CC[C@H](C1)NC1CCSCC1)C(=O)NCc1cc(cc(c1)C(F)(F)F)C(F)(F)F |r|
Show InChI InChI=1S/C23H30F6N2OS/c1-14(2)21(6-3-19(12-21)31-18-4-7-33-8-5-18)20(32)30-13-15-9-16(22(24,25)26)11-17(10-15)23(27,28)29/h9-11,14,18-19,31H,3-8,12-13H2,1-2H3,(H,30,32)/t19-,21+/m1/s1
n/an/a 22n/an/an/an/an/an/a
Merck Research Laboratories
Curated by ChEMBL
Assay Description
Displacement of [125I]hMCP1 from human CCR2 receptor expressed in CHO cells
Bioorg Med Chem Lett 19: 1830-4 (2009)
Article DOI: 10.1016/j.bmcl.2008.12.050
BindingDB Entry DOI: 10.7270/Q2GH9HVZ