BDBM50258188 CHEMBL4060916
SMILES: Cc1ccc2occ(C(=O)Nc3cccc(Cl)c3)c(=O)c2c1
InChI Key: InChIKey=YNDLKCZWKGJMFM-UHFFFAOYSA-N
Data: 1 KI  1 IC50
Activity Spreadsheet -- Enzyme Inhibition Constant Data from BindingDB
Found 2 hits for monomerid = 50258188
Trg + Lig
Ki
nM
ΔG°
kcal/mole
IC50
nM
Kd
nM
EC50/IC50
nM
koff
s-1
kon
M-1s-1
pHTemp
°C
Amine oxidase [flavin-containing] B
(Homo sapiens (Human))
BDBM50258188
(CHEMBL4060916)
Show SMILES Cc1ccc2occ(C(=O)Nc3cccc(Cl)c3)c(=O)c2c1
Show InChI InChI=1S/C17H12ClNO3/c1-10-5-6-15-13(7-10)16(20)14(9-22-15)17(21)19-12-4-2-3-11(18)8-12/h2-9H,1H3,(H,19,21)
2.70n/an/an/an/an/an/an/an/a
CIQUP/Department of Chemistry and Biochemistry, Faculty of Sciences, University of Porto , 4169-007 Porto, Portugal.
Curated by ChEMBL
Assay Description
Noncompetitive inhibition of human recombinant microsomal MAOB expressed in baculovirus infected BTI-TN-5B1- 4 cells using p-tyramine as substrate as...
J Med Chem 60: 7206-7212 (2017)
Article DOI: 10.1021/acs.jmedchem.7b00918
BindingDB Entry DOI: 10.7270/Q23B62KQ
Amine oxidase [flavin-containing] B
(Homo sapiens (Human))
BDBM50258188
(CHEMBL4060916)
Show SMILES Cc1ccc2occ(C(=O)Nc3cccc(Cl)c3)c(=O)c2c1
Show InChI InChI=1S/C17H12ClNO3/c1-10-5-6-15-13(7-10)16(20)14(9-22-15)17(21)19-12-4-2-3-11(18)8-12/h2-9H,1H3,(H,19,21)
n/an/a 4.20n/an/an/an/an/an/a
CIQUP/Department of Chemistry and Biochemistry, Faculty of Sciences, University of Porto , 4169-007 Porto, Portugal.
Curated by ChEMBL
Assay Description
Inhibition of human recombinant microsomal MAOB expressed in baculovirus infected BTI-TN-5B1- 4 cells using p-tyramine as substrate assessed as decre...
J Med Chem 60: 7206-7212 (2017)
Article DOI: 10.1021/acs.jmedchem.7b00918
BindingDB Entry DOI: 10.7270/Q23B62KQ