BDBM50258280 4-(2-(2-methoxy-5-nitrophenyl)-1-(4-methoxyphenyl)ethyl)-1-methyl-1H-imidazol-2-amine::CHEMBL494186
SMILES: COc1ccc(cc1)C(Cc1cc(ccc1OC)[N+]([O-])=O)c1cn(C)c(N)n1
InChI Key: InChIKey=LWIYEMOOCOORBX-UHFFFAOYSA-N
Data: 3 IC50
Activity Spreadsheet -- Enzyme Inhibition Constant Data from BindingDB
Found 3 hits for monomerid = 50258280
Trg + Lig
Ki
nM
ΔG°
kcal/mole
IC50
nM
Kd
nM
EC50/IC50
nM
koff
s-1
kon
M-1s-1
pHTemp
°C
Beta-secretase 1
(Homo sapiens (Human))
BDBM50258280
(4-(2-(2-methoxy-5-nitrophenyl)-1-(4-methoxyphenyl)...)
Show SMILES COc1ccc(cc1)C(Cc1cc(ccc1OC)[N+]([O-])=O)c1cn(C)c(N)n1
Show InChI InChI=1S/C20H22N4O4/c1-23-12-18(22-20(23)21)17(13-4-7-16(27-2)8-5-13)11-14-10-15(24(25)26)6-9-19(14)28-3/h4-10,12,17H,11H2,1-3H3,(H2,21,22)
n/an/a 470n/an/an/an/a6.5n/a
Merck Research Laboratories
Curated by ChEMBL
Assay Description
Inhibition of BACE1 (unknown origin) at pH 6.5
Bioorg Med Chem Lett 19: 2977-80 (2009)
Article DOI: 10.1016/j.bmcl.2009.04.033
BindingDB Entry DOI: 10.7270/Q2XS5V96
Beta-secretase 1
(Homo sapiens (Human))
BDBM50258280
(4-(2-(2-methoxy-5-nitrophenyl)-1-(4-methoxyphenyl)...)
Show SMILES COc1ccc(cc1)C(Cc1cc(ccc1OC)[N+]([O-])=O)c1cn(C)c(N)n1
Show InChI InChI=1S/C20H22N4O4/c1-23-12-18(22-20(23)21)17(13-4-7-16(27-2)8-5-13)11-14-10-15(24(25)26)6-9-19(14)28-3/h4-10,12,17H,11H2,1-3H3,(H2,21,22)
n/an/a 470n/an/an/an/an/an/a
Merck Research Laboratories
Curated by ChEMBL
Assay Description
Inhibition of BACE-1
Bioorg Med Chem Lett 19: 4993-5 (2009)
Article DOI: 10.1016/j.bmcl.2009.07.071
BindingDB Entry DOI: 10.7270/Q2Z31ZP8
Beta-secretase 1
(Homo sapiens (Human))
BDBM50258280
(4-(2-(2-methoxy-5-nitrophenyl)-1-(4-methoxyphenyl)...)
Show SMILES COc1ccc(cc1)C(Cc1cc(ccc1OC)[N+]([O-])=O)c1cn(C)c(N)n1
Show InChI InChI=1S/C20H22N4O4/c1-23-12-18(22-20(23)21)17(13-4-7-16(27-2)8-5-13)11-14-10-15(24(25)26)6-9-19(14)28-3/h4-10,12,17H,11H2,1-3H3,(H2,21,22)
n/an/a 1.80E+3n/an/an/an/an/an/a
Merck Research Laboratories
Curated by ChEMBL
Assay Description
Inhibition of BACE1 (unknown origin) by sAPP_NF cell based assay
Bioorg Med Chem Lett 19: 2977-80 (2009)
Article DOI: 10.1016/j.bmcl.2009.04.033
BindingDB Entry DOI: 10.7270/Q2XS5V96