BDBM50258367 (S)-N-(1-(5-(4-methoxyquinolin-2-yl)-1H-imidazol-2-yl)-7-oxooctyl)-1-methylazetidine-3-carboxamide::CHEMBL2448570
SMILES: CCC(=O)CCCCC[C@H](NC(=O)C1CN(C)C1)c1ncc([nH]1)-c1cc(OC)c2ccccc2n1
InChI Key: InChIKey=HBELWAHFSRENSJ-NRFANRHFSA-N
Data: 1 IC50
Activity Spreadsheet -- Enzyme Inhibition Constant Data from BindingDB
Found 1 hit for monomerid = 50258367
Trg + Lig
Ki
nM
ΔG°
kcal/mole
IC50
nM
Kd
nM
EC50/IC50
nM
koff
s-1
kon
M-1s-1
pHTemp
°C
Histone deacetylase 1
(Homo sapiens (Human))
BDBM50258367
((S)-N-(1-(5-(4-methoxyquinolin-2-yl)-1H-imidazol-2...)
Show SMILES CCC(=O)CCCCC[C@H](NC(=O)C1CN(C)C1)c1ncc([nH]1)-c1cc(OC)c2ccccc2n1 |r|
Show InChI InChI=1S/C26H33N5O3/c1-17(32)9-5-4-6-12-21(30-26(33)18-15-31(2)16-18)25-27-14-23(29-25)22-13-24(34-3)19-10-7-8-11-20(19)28-22/h7-8,10-11,13-14,18,21H,4-6,9,12,15-16H2,1-3H3,(H,27,29)(H,30,33)/t21-/m0/s1
NCI pathway
Reactome pathway
n/an/a 162n/an/an/an/an/an/a
IRBM/Merck Research Laboratories
Curated by ChEMBL
Assay Description
Inhibition of human C-terminal FLAG-tagged HDAC1 in HEK293 cells
J Med Chem 52: 3453-6 (2009)
Article DOI: 10.1021/jm9004303
BindingDB Entry DOI: 10.7270/Q2Q24044