BDBM50258544 CHEMBL4096388
SMILES: CC(C)C[C@H](NC(=O)OCc1ccc(cc1)[N+]([O-])=O)C(=O)N[C@@H](CCc1ccccc1)\C=C\C(C)=O
InChI Key: InChIKey=FXGIQTGYEVOOOM-CATZNBOOSA-N
Data: 2 KI  1 IC50
Activity Spreadsheet -- Enzyme Inhibition Constant Data from BindingDB
Found 3 hits for monomerid = 50258544
Trg + Lig
Ki
nM
ΔG°
kcal/mole
IC50
nM
Kd
nM
EC50/IC50
nM
koff
s-1
kon
M-1s-1
pHTemp
°C
Rhodesain
(Trypanosoma brucei rhodesiense)
BDBM50258544
(CHEMBL4096388)
Show SMILES CC(C)C[C@H](NC(=O)OCc1ccc(cc1)[N+]([O-])=O)C(=O)N[C@@H](CCc1ccccc1)\C=C\C(C)=O |r|
Show InChI InChI=1S/C27H33N3O6/c1-19(2)17-25(29-27(33)36-18-22-11-15-24(16-12-22)30(34)35)26(32)28-23(13-9-20(3)31)14-10-21-7-5-4-6-8-21/h4-9,11-13,15-16,19,23,25H,10,14,17-18H2,1-3H3,(H,28,32)(H,29,33)/b13-9+/t23-,25+/m1/s1
0.900n/an/an/an/an/an/an/an/a
Department of Chemical, Biological, Pharmaceutical and Environmental Sciences, University of Messina , Viale Annunziata, 98168 Messina, Italy.
Curated by ChEMBL
Assay Description
Inhibition of recombinant Trypanosoma brucei rhodesiense rhodesain expressed in Pichia pastoris using Cbz-Phe-Arg-AMC as substrate after 30 min by fl...
J Med Chem 60: 6911-6923 (2017)
Article DOI: 10.1021/acs.jmedchem.7b00405
BindingDB Entry DOI: 10.7270/Q2FJ2K73
Procathepsin L
(Homo sapiens (Human))
BDBM50258544
(CHEMBL4096388)
Show SMILES CC(C)C[C@H](NC(=O)OCc1ccc(cc1)[N+]([O-])=O)C(=O)N[C@@H](CCc1ccccc1)\C=C\C(C)=O |r|
Show InChI InChI=1S/C27H33N3O6/c1-19(2)17-25(29-27(33)36-18-22-11-15-24(16-12-22)30(34)35)26(32)28-23(13-9-20(3)31)14-10-21-7-5-4-6-8-21/h4-9,11-13,15-16,19,23,25H,10,14,17-18H2,1-3H3,(H,28,32)(H,29,33)/b13-9+/t23-,25+/m1/s1
Reactome pathway
3.5n/an/an/an/an/an/an/an/a
Department of Chemical, Biological, Pharmaceutical and Environmental Sciences, University of Messina , Viale Annunziata, 98168 Messina, Italy.
Curated by ChEMBL
Assay Description
Inhibition of human cathepsin L using Cbz-Phe-Arg-AMC as substrate after 10 mins by fluorescence assay
J Med Chem 60: 6911-6923 (2017)
Article DOI: 10.1021/acs.jmedchem.7b00405
BindingDB Entry DOI: 10.7270/Q2FJ2K73
Falcipain 2
(Plasmodium falciparum)
BDBM50258544
(CHEMBL4096388)
Show SMILES CC(C)C[C@H](NC(=O)OCc1ccc(cc1)[N+]([O-])=O)C(=O)N[C@@H](CCc1ccccc1)\C=C\C(C)=O |r|
Show InChI InChI=1S/C27H33N3O6/c1-19(2)17-25(29-27(33)36-18-22-11-15-24(16-12-22)30(34)35)26(32)28-23(13-9-20(3)31)14-10-21-7-5-4-6-8-21/h4-9,11-13,15-16,19,23,25H,10,14,17-18H2,1-3H3,(H,28,32)(H,29,33)/b13-9+/t23-,25+/m1/s1
n/an/a 110n/an/an/an/an/an/a
Department of Chemical, Biological, Pharmaceutical and Environmental Sciences, University of Messina , Viale Annunziata, 98168 Messina, Italy.
Curated by ChEMBL
Assay Description
Inhibition of recombinant Plasmodium falciparum falcipain-2 expressed in Escherichia coli M15(pREP4) using Cbz-Phe-Arg-AMC as substrate by fluorescen...
J Med Chem 60: 6911-6923 (2017)
Article DOI: 10.1021/acs.jmedchem.7b00405
BindingDB Entry DOI: 10.7270/Q2FJ2K73