BDBM50258564 (S)-6-(2-(pyridin-4-yl)phenyl)-6,7-dihydro-5H-pyrrolo[1,2-a]imidazole::CHEMBL512289
SMILES: C1[C@H](Cn2ccnc12)c1ccccc1-c1ccncc1
InChI Key: InChIKey=PEIDTOAIWXQRBC-CQSZACIVSA-N
Data: 1 KI  3 EC50
Activity Spreadsheet -- Enzyme Inhibition Constant Data from BindingDB
Found 4 hits for monomerid = 50258564
Trg + Lig
Ki
nM
ΔG°
kcal/mole
IC50
nM
Kd
nM
EC50/IC50
nM
koff
s-1
kon
M-1s-1
pHTemp
°C
Alpha-2A adrenergic receptor
(Homo sapiens (Human))
BDBM50258564
((S)-6-(2-(pyridin-4-yl)phenyl)-6,7-dihydro-5H-pyrr...)
Show SMILES C1[C@H](Cn2ccnc12)c1ccccc1-c1ccncc1 |r|
Show InChI InChI=1S/C17H15N3/c1-2-4-16(14-11-17-19-9-10-20(17)12-14)15(3-1)13-5-7-18-8-6-13/h1-10,14H,11-12H2/t14-/m1/s1
112n/an/an/an/an/an/an/an/a
Pfizer Global Research and Development
Curated by ChEMBL
Assay Description
Inhibition of adrenergic alpha2A receptor (unknown origin)
Bioorg Med Chem Lett 19: 3113-7 (2009)
Article DOI: 10.1016/j.bmcl.2009.03.166
BindingDB Entry DOI: 10.7270/Q2WS8T5T
Alpha-1A adrenergic receptor
(Homo sapiens (Human))
BDBM50258564
((S)-6-(2-(pyridin-4-yl)phenyl)-6,7-dihydro-5H-pyrr...)
Show SMILES C1[C@H](Cn2ccnc12)c1ccccc1-c1ccncc1 |r|
Show InChI InChI=1S/C17H15N3/c1-2-4-16(14-11-17-19-9-10-20(17)12-14)15(3-1)13-5-7-18-8-6-13/h1-10,14H,11-12H2/t14-/m1/s1
Reactome pathway
n/an/an/an/a 81n/an/an/an/a
Pfizer Global Research and Development
Curated by ChEMBL
Assay Description
Agonist activity at human adrenergic alpha1A receptor expressed in CHO cells assessed as calcium mobilization by FLIPR
Bioorg Med Chem Lett 19: 3113-7 (2009)
Article DOI: 10.1016/j.bmcl.2009.03.166
BindingDB Entry DOI: 10.7270/Q2WS8T5T
Adrenergic alpha1B
(Homo sapiens (Human))
BDBM50258564
((S)-6-(2-(pyridin-4-yl)phenyl)-6,7-dihydro-5H-pyrr...)
Show SMILES C1[C@H](Cn2ccnc12)c1ccccc1-c1ccncc1 |r|
Show InChI InChI=1S/C17H15N3/c1-2-4-16(14-11-17-19-9-10-20(17)12-14)15(3-1)13-5-7-18-8-6-13/h1-10,14H,11-12H2/t14-/m1/s1
n/an/an/an/a>1.00E+4n/an/an/an/a
Pfizer Global Research and Development
Curated by ChEMBL
Assay Description
Agonist activity at human adrenergic alpha1B receptor expressed in CHO cells assessed as calcium mobilization by FLIPR
Bioorg Med Chem Lett 19: 3113-7 (2009)
Article DOI: 10.1016/j.bmcl.2009.03.166
BindingDB Entry DOI: 10.7270/Q2WS8T5T
Alpha-1D adrenergic receptor
(Homo sapiens (Human))
BDBM50258564
((S)-6-(2-(pyridin-4-yl)phenyl)-6,7-dihydro-5H-pyrr...)
Show SMILES C1[C@H](Cn2ccnc12)c1ccccc1-c1ccncc1 |r|
Show InChI InChI=1S/C17H15N3/c1-2-4-16(14-11-17-19-9-10-20(17)12-14)15(3-1)13-5-7-18-8-6-13/h1-10,14H,11-12H2/t14-/m1/s1
Reactome pathway
n/an/an/an/a 656n/an/an/an/a
Pfizer Global Research and Development
Curated by ChEMBL
Assay Description
Agonist activity at human adrenergic alpha1D receptor expressed in CHO cells assessed as calcium mobilization by FLIPR
Bioorg Med Chem Lett 19: 3113-7 (2009)
Article DOI: 10.1016/j.bmcl.2009.03.166
BindingDB Entry DOI: 10.7270/Q2WS8T5T