BDBM50258626 (S)-7-(2-(5-methoxy-2-methyl-1H-indol-3-yl)acetamido)-7-(5-(naphthalen-2-yl)-1H-imidazol-2-yl)heptanamide::CHEMBL466215
SMILES: COc1ccc2[nH]c(C)c(CC(=O)N[C@@H](CCCCCC(N)=O)c3nc(c[nH]3)-c3ccc4ccccc4c3)c2c1
InChI Key: InChIKey=QZLKZEZKQRUHEU-NDEPHWFRSA-N
Data: 6 IC50
Activity Spreadsheet -- Enzyme Inhibition Constant Data from BindingDB
Found 6 hits for monomerid = 50258626
Trg + Lig
Ki
nM
ΔG°
kcal/mole
IC50
nM
Kd
nM
EC50/IC50
nM
koff
s-1
kon
M-1s-1
pHTemp
°C
Histone deacetylase 1
(Homo sapiens (Human))
BDBM50258626
((S)-7-(2-(5-methoxy-2-methyl-1H-indol-3-yl)acetami...)
Show SMILES COc1ccc2[nH]c(C)c(CC(=O)N[C@@H](CCCCCC(N)=O)c3nc(c[nH]3)-c3ccc4ccccc4c3)c2c1 |r|
Show InChI InChI=1S/C32H35N5O3/c1-20-25(26-17-24(40-2)14-15-27(26)35-20)18-31(39)36-28(10-4-3-5-11-30(33)38)32-34-19-29(37-32)23-13-12-21-8-6-7-9-22(21)16-23/h6-9,12-17,19,28,35H,3-5,10-11,18H2,1-2H3,(H2,33,38)(H,34,37)(H,36,39)/t28-/m0/s1
NCI pathway
Reactome pathway
n/an/a 30n/an/an/an/an/an/a
IRBM/Merck Research Laboratories
Curated by ChEMBL
Assay Description
Inhibition of C-terminal FLAG tagged HDAC1 (unknown origin)
Bioorg Med Chem Lett 19: 3081-4 (2009)
Article DOI: 10.1016/j.bmcl.2009.04.011
BindingDB Entry DOI: 10.7270/Q2P84BSJ
Histone deacetylase 2
(Homo sapiens (Human))
BDBM50258626
((S)-7-(2-(5-methoxy-2-methyl-1H-indol-3-yl)acetami...)
Show SMILES COc1ccc2[nH]c(C)c(CC(=O)N[C@@H](CCCCCC(N)=O)c3nc(c[nH]3)-c3ccc4ccccc4c3)c2c1 |r|
Show InChI InChI=1S/C32H35N5O3/c1-20-25(26-17-24(40-2)14-15-27(26)35-20)18-31(39)36-28(10-4-3-5-11-30(33)38)32-34-19-29(37-32)23-13-12-21-8-6-7-9-22(21)16-23/h6-9,12-17,19,28,35H,3-5,10-11,18H2,1-2H3,(H2,33,38)(H,34,37)(H,36,39)/t28-/m0/s1
NCI pathway
Reactome pathway
n/an/a 160n/an/an/an/an/an/a
IRBM/Merck Research Laboratories
Curated by ChEMBL
Assay Description
Inhibition of C-terminal FLAG tagged HDAC2 (unknown origin)
Bioorg Med Chem Lett 19: 3081-4 (2009)
Article DOI: 10.1016/j.bmcl.2009.04.011
BindingDB Entry DOI: 10.7270/Q2P84BSJ
Histone deacetylase 8
(Homo sapiens (Human))
BDBM50258626
((S)-7-(2-(5-methoxy-2-methyl-1H-indol-3-yl)acetami...)
Show SMILES COc1ccc2[nH]c(C)c(CC(=O)N[C@@H](CCCCCC(N)=O)c3nc(c[nH]3)-c3ccc4ccccc4c3)c2c1 |r|
Show InChI InChI=1S/C32H35N5O3/c1-20-25(26-17-24(40-2)14-15-27(26)35-20)18-31(39)36-28(10-4-3-5-11-30(33)38)32-34-19-29(37-32)23-13-12-21-8-6-7-9-22(21)16-23/h6-9,12-17,19,28,35H,3-5,10-11,18H2,1-2H3,(H2,33,38)(H,34,37)(H,36,39)/t28-/m0/s1
NCI pathway
Reactome pathway
n/an/a>5.00E+3n/an/an/an/an/an/a
IRBM/Merck Research Laboratories
Curated by ChEMBL
Assay Description
Inhibition of His-tagged HDAC8 catalytic domain (unknown origin) expressed in Escherichia coli
Bioorg Med Chem Lett 19: 3081-4 (2009)
Article DOI: 10.1016/j.bmcl.2009.04.011
BindingDB Entry DOI: 10.7270/Q2P84BSJ
Histone deacetylase 4
(Homo sapiens (Human))
BDBM50258626
((S)-7-(2-(5-methoxy-2-methyl-1H-indol-3-yl)acetami...)
Show SMILES COc1ccc2[nH]c(C)c(CC(=O)N[C@@H](CCCCCC(N)=O)c3nc(c[nH]3)-c3ccc4ccccc4c3)c2c1 |r|
Show InChI InChI=1S/C32H35N5O3/c1-20-25(26-17-24(40-2)14-15-27(26)35-20)18-31(39)36-28(10-4-3-5-11-30(33)38)32-34-19-29(37-32)23-13-12-21-8-6-7-9-22(21)16-23/h6-9,12-17,19,28,35H,3-5,10-11,18H2,1-2H3,(H2,33,38)(H,34,37)(H,36,39)/t28-/m0/s1
n/an/a>1.00E+4n/an/an/an/an/an/a
IRBM/Merck Research Laboratories
Curated by ChEMBL
Assay Description
Inhibition of His-tagged HDAC4 catalytic domain (unknown origin) expressed in Escherichia coli
Bioorg Med Chem Lett 19: 3081-4 (2009)
Article DOI: 10.1016/j.bmcl.2009.04.011
BindingDB Entry DOI: 10.7270/Q2P84BSJ
Histone deacetylase 6
(Homo sapiens (Human))
BDBM50258626
((S)-7-(2-(5-methoxy-2-methyl-1H-indol-3-yl)acetami...)
Show SMILES COc1ccc2[nH]c(C)c(CC(=O)N[C@@H](CCCCCC(N)=O)c3nc(c[nH]3)-c3ccc4ccccc4c3)c2c1 |r|
Show InChI InChI=1S/C32H35N5O3/c1-20-25(26-17-24(40-2)14-15-27(26)35-20)18-31(39)36-28(10-4-3-5-11-30(33)38)32-34-19-29(37-32)23-13-12-21-8-6-7-9-22(21)16-23/h6-9,12-17,19,28,35H,3-5,10-11,18H2,1-2H3,(H2,33,38)(H,34,37)(H,36,39)/t28-/m0/s1
NCI pathway
Reactome pathway
n/an/a 120n/an/an/an/an/an/a
IRBM/Merck Research Laboratories
Curated by ChEMBL
Assay Description
Inhibition of C-terminal FLAG tagged HDAC6 (unknown origin)
Bioorg Med Chem Lett 19: 3081-4 (2009)
Article DOI: 10.1016/j.bmcl.2009.04.011
BindingDB Entry DOI: 10.7270/Q2P84BSJ
Histone deacetylase 3
(Homo sapiens (Human))
BDBM50258626
((S)-7-(2-(5-methoxy-2-methyl-1H-indol-3-yl)acetami...)
Show SMILES COc1ccc2[nH]c(C)c(CC(=O)N[C@@H](CCCCCC(N)=O)c3nc(c[nH]3)-c3ccc4ccccc4c3)c2c1 |r|
Show InChI InChI=1S/C32H35N5O3/c1-20-25(26-17-24(40-2)14-15-27(26)35-20)18-31(39)36-28(10-4-3-5-11-30(33)38)32-34-19-29(37-32)23-13-12-21-8-6-7-9-22(21)16-23/h6-9,12-17,19,28,35H,3-5,10-11,18H2,1-2H3,(H2,33,38)(H,34,37)(H,36,39)/t28-/m0/s1
NCI pathway
Reactome pathway
n/an/a 250n/an/an/an/an/an/a
IRBM/Merck Research Laboratories
Curated by ChEMBL
Assay Description
Inhibition of C-terminal FLAG tagged HDAC3 (unknown origin)
Bioorg Med Chem Lett 19: 3081-4 (2009)
Article DOI: 10.1016/j.bmcl.2009.04.011
BindingDB Entry DOI: 10.7270/Q2P84BSJ