BDBM50258791 4-(3-exo-Hydroxy-8-azabicyclo[3.2.1]oct-8-yl)naphthalene-1-carbonitrile::4-(3-hydroxy-8-azabicyclo[3.2.1]octan-8-yl)-1-naphthonitrile::CHEMBL468938
SMILES: OC1CC2CCC(C1)N2c1ccc(C#N)c2ccccc12
InChI Key: InChIKey=ATKWLNSCJYLXPF-UHFFFAOYSA-N
Data: 1 KI  1 EC50
Activity Spreadsheet -- Enzyme Inhibition Constant Data from BindingDB
Found 2 hits for monomerid = 50258791
Trg + Lig
Ki
nM
ΔG°
kcal/mole
IC50
nM
Kd
nM
EC50/IC50
nM
koff
s-1
kon
M-1s-1
pHTemp
°C
Androgen Receptor
(Homo sapiens (Human))
BDBM50258791
(4-(3-exo-Hydroxy-8-azabicyclo[3.2.1]oct-8-yl)napht...)
Show SMILES OC1CC2CCC(C1)N2c1ccc(C#N)c2ccccc12 |TLB:0:1:8:4.5,9:8:7.1.2:4.5|
Show InChI InChI=1S/C18H18N2O/c19-11-12-5-8-18(17-4-2-1-3-16(12)17)20-13-6-7-14(20)10-15(21)9-13/h1-5,8,13-15,21H,6-7,9-10H2
NCI pathway
Reactome pathway
5n/an/an/an/an/an/an/an/a
GTx, Inc.
Curated by ChEMBL
Assay Description
Agonist activity at androgen receptor (unknown origin)
J Med Chem 52: 3597-617 (2009)
Article DOI: 10.1021/jm900280m
BindingDB Entry DOI: 10.7270/Q2GH9HWD
Androgen Receptor
(Mus musculus)
BDBM50258791
(4-(3-exo-Hydroxy-8-azabicyclo[3.2.1]oct-8-yl)napht...)
Show SMILES OC1CC2CCC(C1)N2c1ccc(C#N)c2ccccc12 |TLB:0:1:8:4.5,9:8:7.1.2:4.5|
Show InChI InChI=1S/C18H18N2O/c19-11-12-5-8-18(17-4-2-1-3-16(12)17)20-13-6-7-14(20)10-15(21)9-13/h1-5,8,13-15,21H,6-7,9-10H2
Reactome pathway
n/an/an/an/a 100n/an/an/an/a
ACADIA Pharmaceuticals AB
Curated by ChEMBL
Assay Description
Agonist activity at androgen receptor in mouse NIH3T3 cells transiently transfected with beta-galactosidase reporter gene assessed as cellular transf...
J Med Chem 52: 7186-91 (2009)
Article DOI: 10.1021/jm901149c
BindingDB Entry DOI: 10.7270/Q2SJ1MV9