BDBM50258932 CHEMBL4098223
SMILES: COCC(NC(=O)N1CC(=O)Nc2cccnc12)c1ccc(OC(F)(F)F)cc1
InChI Key: InChIKey=TYKVIJVZIDLTAG-UHFFFAOYSA-N
Data: 1 IC50
Activity Spreadsheet -- Enzyme Inhibition Constant Data from BindingDB
Found 1 hit for monomerid = 50258932
Trg + Lig
Ki
nM
ΔG°
kcal/mole
IC50
nM
Kd
nM
EC50/IC50
nM
koff
s-1
kon
M-1s-1
pHTemp
°C
Homo sapiens phosphodiesterase 2A (PDE2A)
(Homo sapiens (Human))
BDBM50258932
(CHEMBL4098223)
Show SMILES COCC(NC(=O)N1CC(=O)Nc2cccnc12)c1ccc(OC(F)(F)F)cc1
Show InChI InChI=1S/C18H17F3N4O4/c1-28-10-14(11-4-6-12(7-5-11)29-18(19,20)21)24-17(27)25-9-15(26)23-13-3-2-8-22-16(13)25/h2-8,14H,9-10H2,1H3,(H,23,26)(H,24,27)
n/an/a 19n/an/an/an/an/an/a
Takeda Pharmaceutical Company Limited
Curated by ChEMBL
Assay Description
Inhibition of recombinant human FLAG-tagged PDE2A3 expressed in sf21 cells using [3H]cGMP as substrate by scintillation proximity assay
J Med Chem 60: 7677-7702 (2017)
Article DOI: 10.1021/acs.jmedchem.7b00807
BindingDB Entry DOI: 10.7270/Q2P271JR