BDBM50258992 CHEMBL4081323
SMILES: O=C(CSC(=S)NN1CCOCC1)NCc1ccc2OCOc2c1
InChI Key: InChIKey=UECJOGYRJOLAOM-UHFFFAOYSA-N
Data: 2 IC50
Activity Spreadsheet -- Enzyme Inhibition Constant Data from BindingDB
Found 2 hits for monomerid = 50258992
Trg + Lig
Ki
nM
ΔG°
kcal/mole
IC50
nM
Kd
nM
EC50/IC50
nM
koff
s-1
kon
M-1s-1
pHTemp
°C
Carbonic anhydrase 2
(Homo sapiens (Human))
BDBM50258992
(CHEMBL4081323)
Show SMILES O=C(CSC(=S)NN1CCOCC1)NCc1ccc2OCOc2c1
Show InChI InChI=1S/C15H19N3O4S2/c19-14(9-24-15(23)17-18-3-5-20-6-4-18)16-8-11-1-2-12-13(7-11)22-10-21-12/h1-2,7H,3-6,8-10H2,(H,16,19)(H,17,23)
Reactome pathway
n/an/a 0.287n/an/an/an/an/an/a
Anadolu University
Curated by ChEMBL
Assay Description
Inhibition of human erythrocyte carbonic anhydrase-2
Eur J Med Chem 125: 190-196 (2017)
Article DOI: 10.1016/j.ejmech.2016.09.035
BindingDB Entry DOI: 10.7270/Q2542R29
Carbonic anhydrase 1
(Homo sapiens (Human))
BDBM50258992
(CHEMBL4081323)
Show SMILES O=C(CSC(=S)NN1CCOCC1)NCc1ccc2OCOc2c1
Show InChI InChI=1S/C15H19N3O4S2/c19-14(9-24-15(23)17-18-3-5-20-6-4-18)16-8-11-1-2-12-13(7-11)22-10-21-12/h1-2,7H,3-6,8-10H2,(H,16,19)(H,17,23)
NCI pathway
Reactome pathway
n/an/a 0.346n/an/an/an/an/an/a
Anadolu University
Curated by ChEMBL
Assay Description
Inhibition of human erythrocyte carbonic anhydrase-1
Eur J Med Chem 125: 190-196 (2017)
Article DOI: 10.1016/j.ejmech.2016.09.035
BindingDB Entry DOI: 10.7270/Q2542R29