BDBM50259016 3-isopropyl-5-(2-(trifluoromethoxy)benzyl)-1H-pyrazolo[4,3-d]pyrimidin-7(6H)-one::CHEMBL467282
SMILES: CC(C)c1[nH]nc2c1nc(Cc1ccccc1OC(F)(F)F)[nH]c2=O
InChI Key: InChIKey=RCKCFOKBILAFJF-UHFFFAOYSA-N
Data: 3 IC50
Activity Spreadsheet -- Enzyme Inhibition Constant Data from BindingDB
Found 3 hits for monomerid = 50259016
Trg + Lig
Ki
nM
ΔG°
kcal/mole
IC50
nM
Kd
nM
EC50/IC50
nM
koff
s-1
kon
M-1s-1
pHTemp
°C
Calcium/calmodulin-dependent 3',5'-cyclic nucleotide phosphodiesterase 1B
(Homo sapiens (Human))
BDBM50259016
(3-isopropyl-5-(2-(trifluoromethoxy)benzyl)-1H-pyra...)
Show SMILES CC(C)c1[nH]nc2c1nc(Cc1ccccc1OC(F)(F)F)[nH]c2=O
Show InChI InChI=1S/C16H15F3N4O2/c1-8(2)12-13-14(23-22-12)15(24)21-11(20-13)7-9-5-3-4-6-10(9)25-16(17,18)19/h3-6,8H,7H2,1-2H3,(H,22,23)(H,20,21,24)
Reactome pathway
n/an/a 2.65E+3n/an/an/an/an/an/a
Pfizer Global Research and Development
Curated by ChEMBL
Assay Description
Inhibition of PDE1b
Bioorg Med Chem Lett 19: 2537-41 (2009)
Article DOI: 10.1016/j.bmcl.2009.03.024
BindingDB Entry DOI: 10.7270/Q2RB74GG
Calcium/calmodulin-dependent 3',5'-cyclic nucleotide phosphodiesterase 1C
(Homo sapiens (Human))
BDBM50259016
(3-isopropyl-5-(2-(trifluoromethoxy)benzyl)-1H-pyra...)
Show SMILES CC(C)c1[nH]nc2c1nc(Cc1ccccc1OC(F)(F)F)[nH]c2=O
Show InChI InChI=1S/C16H15F3N4O2/c1-8(2)12-13-14(23-22-12)15(24)21-11(20-13)7-9-5-3-4-6-10(9)25-16(17,18)19/h3-6,8H,7H2,1-2H3,(H,22,23)(H,20,21,24)
n/an/a 520n/an/an/an/an/an/a
Pfizer Global Research and Development
Curated by ChEMBL
Assay Description
Inhibition of PDE1c
Bioorg Med Chem Lett 19: 2537-41 (2009)
Article DOI: 10.1016/j.bmcl.2009.03.024
BindingDB Entry DOI: 10.7270/Q2RB74GG
Calcium/calmodulin-dependent 3',5'-cyclic nucleotide phosphodiesterase 1A
(Homo sapiens (Human))
BDBM50259016
(3-isopropyl-5-(2-(trifluoromethoxy)benzyl)-1H-pyra...)
Show SMILES CC(C)c1[nH]nc2c1nc(Cc1ccccc1OC(F)(F)F)[nH]c2=O
Show InChI InChI=1S/C16H15F3N4O2/c1-8(2)12-13-14(23-22-12)15(24)21-11(20-13)7-9-5-3-4-6-10(9)25-16(17,18)19/h3-6,8H,7H2,1-2H3,(H,22,23)(H,20,21,24)
n/an/a 2.50E+3n/an/an/an/an/an/a
Pfizer Global Research and Development
Curated by ChEMBL
Assay Description
Inhibition of PDE1a
Bioorg Med Chem Lett 19: 2537-41 (2009)
Article DOI: 10.1016/j.bmcl.2009.03.024
BindingDB Entry DOI: 10.7270/Q2RB74GG