BDBM50259392 2-(5-tert-butyl-9-(4-chlorophenyl)-3-oxo-2,3-dihydropyrido[3,2-e][1,2,4]triazolo[4,3-c]pyrimidin-8-yl)benzonitrile::CHEMBL467529
SMILES: CC(C)(C)c1nc2nc(-c3ccccc3C#N)c(cc2c2n[nH]c(=O)n12)-c1ccc(Cl)cc1
InChI Key: InChIKey=XXQJZERJMPSQHM-UHFFFAOYSA-N
Data: 2 IC50
Activity Spreadsheet -- Enzyme Inhibition Constant Data from BindingDB
Found 2 hits for monomerid = 50259392
Trg + Lig
Ki
nM
ΔG°
kcal/mole
IC50
nM
Kd
nM
EC50/IC50
nM
koff
s-1
kon
M-1s-1
pHTemp
°C
Cannabinoid receptor 2
(Homo sapiens (Human))
BDBM50259392
(2-(5-tert-butyl-9-(4-chlorophenyl)-3-oxo-2,3-dihyd...)
Show SMILES CC(C)(C)c1nc2nc(-c3ccccc3C#N)c(cc2c2n[nH]c(=O)n12)-c1ccc(Cl)cc1
Show InChI InChI=1S/C25H19ClN6O/c1-25(2,3)23-29-21-19(22-30-31-24(33)32(22)23)12-18(14-8-10-16(26)11-9-14)20(28-21)17-7-5-4-6-15(17)13-27/h4-12H,1-3H3,(H,31,33)
Reactome pathway
n/an/a 2.40E+3n/an/an/an/an/an/a
Merck Research Laboratories
Curated by ChEMBL
Assay Description
Binding affinity to human cannabinoid CB2R expressed in CHO cells
Bioorg Med Chem Lett 19: 2591-4 (2009)
Article DOI: 10.1016/j.bmcl.2009.03.005
BindingDB Entry DOI: 10.7270/Q2PK0G1X
Cannabinoid receptor 1
(Homo sapiens (Human))
BDBM50259392
(2-(5-tert-butyl-9-(4-chlorophenyl)-3-oxo-2,3-dihyd...)
Show SMILES CC(C)(C)c1nc2nc(-c3ccccc3C#N)c(cc2c2n[nH]c(=O)n12)-c1ccc(Cl)cc1
Show InChI InChI=1S/C25H19ClN6O/c1-25(2,3)23-29-21-19(22-30-31-24(33)32(22)23)12-18(14-8-10-16(26)11-9-14)20(28-21)17-7-5-4-6-15(17)13-27/h4-12H,1-3H3,(H,31,33)
NCI pathway
Reactome pathway
n/an/a 3.20n/an/an/an/an/an/a
Merck Research Laboratories
Curated by ChEMBL
Assay Description
Inverse agonist activity at human cannabinoid CB1R expressed in CHO cells assessed as effect on cAMP accumulation
Bioorg Med Chem Lett 19: 2591-4 (2009)
Article DOI: 10.1016/j.bmcl.2009.03.005
BindingDB Entry DOI: 10.7270/Q2PK0G1X