BDBM50259479 3-{[1-(2-Fluorophenyl)ethyl]amino}-4-(pyridin-4-ylamino)cyclobut-3-ene-1,2-dione::CHEMBL467730
SMILES: CC(Nc1c(Nc2ccncc2)c(=O)c1=O)c1ccccc1F
InChI Key: InChIKey=UXUWXYVYMSXPBA-UHFFFAOYSA-N
Data: 1 IC50
Activity Spreadsheet -- Enzyme Inhibition Constant Data from BindingDB
Found 1 hit for monomerid = 50259479
Trg + Lig
Ki
nM
ΔG°
kcal/mole
IC50
nM
Kd
nM
EC50/IC50
nM
koff
s-1
kon
M-1s-1
pHTemp
°C
MAP kinase-activated protein kinase 2
(Homo sapiens (Human))
BDBM50259479
(3-{[1-(2-Fluorophenyl)ethyl]amino}-4-(pyridin-4-yl...)
Show SMILES CC(Nc1c(Nc2ccncc2)c(=O)c1=O)c1ccccc1F
Show InChI InChI=1S/C17H14FN3O2/c1-10(12-4-2-3-5-13(12)18)20-14-15(17(23)16(14)22)21-11-6-8-19-9-7-11/h2-10,20H,1H3,(H,19,21)
NCI pathway
Reactome pathway
n/an/a 9.30E+3n/an/an/an/an/an/a
Wyeth Research
Curated by ChEMBL
Assay Description
Inhibition of human recombinant MK2
Bioorg Med Chem 17: 3342-51 (2009)
Article DOI: 10.1016/j.bmc.2009.03.041
BindingDB Entry DOI: 10.7270/Q2WW7HK4
3D
3D Structure (docked)