BDBM50259492 5-tert-butyl-8-(2-chlorophenyl)-9-(4-(trifluoromethyl)phenyl)pyrido[3,2-e][1,2,4]triazolo[4,3-c]pyrimidin-3(2H)-one::CHEMBL467914
SMILES: CC(C)(C)c1nc2nc(-c3ccccc3Cl)c(cc2c2n[nH]c(=O)n12)-c1ccc(cc1)C(F)(F)F
InChI Key: InChIKey=BJZUFWMYCASYFE-UHFFFAOYSA-N
Data: 2 IC50
Activity Spreadsheet -- Enzyme Inhibition Constant Data from BindingDB
Found 2 hits for monomerid = 50259492
Trg + Lig
Ki
nM
ΔG°
kcal/mole
IC50
nM
Kd
nM
EC50/IC50
nM
koff
s-1
kon
M-1s-1
pHTemp
°C
Cannabinoid receptor 2
(Homo sapiens (Human))
BDBM50259492
(5-tert-butyl-8-(2-chlorophenyl)-9-(4-(trifluoromet...)
Show SMILES CC(C)(C)c1nc2nc(-c3ccccc3Cl)c(cc2c2n[nH]c(=O)n12)-c1ccc(cc1)C(F)(F)F
Show InChI InChI=1S/C25H19ClF3N5O/c1-24(2,3)22-31-20-17(21-32-33-23(35)34(21)22)12-16(13-8-10-14(11-9-13)25(27,28)29)19(30-20)15-6-4-5-7-18(15)26/h4-12H,1-3H3,(H,33,35)
Reactome pathway
n/an/a 9.20E+3n/an/an/an/an/an/a
Merck Research Laboratories
Curated by ChEMBL
Assay Description
Binding affinity to human cannabinoid CB2R expressed in CHO cells
Bioorg Med Chem Lett 19: 2591-4 (2009)
Article DOI: 10.1016/j.bmcl.2009.03.005
BindingDB Entry DOI: 10.7270/Q2PK0G1X
Cannabinoid receptor 1
(Homo sapiens (Human))
BDBM50259492
(5-tert-butyl-8-(2-chlorophenyl)-9-(4-(trifluoromet...)
Show SMILES CC(C)(C)c1nc2nc(-c3ccccc3Cl)c(cc2c2n[nH]c(=O)n12)-c1ccc(cc1)C(F)(F)F
Show InChI InChI=1S/C25H19ClF3N5O/c1-24(2,3)22-31-20-17(21-32-33-23(35)34(21)22)12-16(13-8-10-14(11-9-13)25(27,28)29)19(30-20)15-6-4-5-7-18(15)26/h4-12H,1-3H3,(H,33,35)
NCI pathway
Reactome pathway
n/an/a 1.10n/an/an/an/an/an/a
Merck Research Laboratories
Curated by ChEMBL
Assay Description
Inverse agonist activity at human cannabinoid CB1R expressed in CHO cells assessed as effect on cAMP accumulation
Bioorg Med Chem Lett 19: 2591-4 (2009)
Article DOI: 10.1016/j.bmcl.2009.03.005
BindingDB Entry DOI: 10.7270/Q2PK0G1X