BDBM50259567 (R)-3-(1-phenylethylamino)-4-(pyridin-3-ylamino)cyclobut-3-ene-1,2-dione::CHEMBL505335
SMILES: C[C@@H](Nc1c(Nc2cccnc2)c(=O)c1=O)c1ccccc1
InChI Key: InChIKey=IEAWZSGFVGPNOH-LLVKDONJSA-N
Data: 1 IC50
Activity Spreadsheet -- Enzyme Inhibition Constant Data from BindingDB
Found 1 hit for monomerid = 50259567
Trg + Lig
Ki
nM
ΔG°
kcal/mole
IC50
nM
Kd
nM
EC50/IC50
nM
koff
s-1
kon
M-1s-1
pHTemp
°C
MAP kinase-activated protein kinase 2
(Homo sapiens (Human))
BDBM50259567
((R)-3-(1-phenylethylamino)-4-(pyridin-3-ylamino)cy...)
Show SMILES C[C@@H](Nc1c(Nc2cccnc2)c(=O)c1=O)c1ccccc1 |r|
Show InChI InChI=1S/C17H15N3O2/c1-11(12-6-3-2-4-7-12)19-14-15(17(22)16(14)21)20-13-8-5-9-18-10-13/h2-11,19-20H,1H3/t11-/m1/s1
NCI pathway
Reactome pathway
n/an/a>1.00E+5n/an/an/an/an/an/a
Wyeth Research
Curated by ChEMBL
Assay Description
Inhibition of human recombinant MK2
Bioorg Med Chem 17: 3342-51 (2009)
Article DOI: 10.1016/j.bmc.2009.03.041
BindingDB Entry DOI: 10.7270/Q2WW7HK4