BDBM50259589 CHEMBL4065432
SMILES: CC[C@@H](CO)Nc1ccc2ncc(-c3cccc(\C=N\O)c3)n2n1
InChI Key: InChIKey=FTGAOPZDJRWUTG-FRSZACSASA-N
Data: 11 IC50
Activity Spreadsheet -- Enzyme Inhibition Constant Data from BindingDB
Found 11 hits for monomerid = 50259589
Trg + Lig
Ki
nM
ΔG°
kcal/mole
IC50
nM
Kd
nM
EC50/IC50
nM
koff
s-1
kon
M-1s-1
pHTemp
°C
Dual-specificity tyrosine-phosphorylation regulated kinase 3
(Homo sapiens (Human))
BDBM50259589
(CHEMBL4065432)
Show SMILES CC[C@@H](CO)Nc1ccc2ncc(-c3cccc(\C=N\O)c3)n2n1 |r|
Show InChI InChI=1S/C17H19N5O2/c1-2-14(11-23)20-16-6-7-17-18-10-15(22(17)21-16)13-5-3-4-12(8-13)9-19-24/h3-10,14,23-24H,2,11H2,1H3,(H,20,21)/b19-9+/t14-/m0/s1
n/an/a 920n/an/an/an/an/an/a
ManRos Therapeutics, Perharidy Research Center, 29680 Roscoff, Bretagne, France; Unité de Technologies Chimiques et Biologiques pour la Santé, Université Paris Descartes, UMR-S 1022 Inserm, 4 avenue
Curated by ChEMBL
Assay Description
Inhibition of GST tagged recombinant human DYRK3 expressed in Escherichia coli using woodtide as substrate after 30 mins by [gamma-33P]ATP based scin...
Eur J Med Chem 125: 696-709 (2017)
Article DOI: 10.1016/j.ejmech.2016.09.064
BindingDB Entry DOI: 10.7270/Q2M61NPG
Dual specificity protein kinase CLK2
(Mus musculus)
BDBM50259589
(CHEMBL4065432)
Show SMILES CC[C@@H](CO)Nc1ccc2ncc(-c3cccc(\C=N\O)c3)n2n1 |r|
Show InChI InChI=1S/C17H19N5O2/c1-2-14(11-23)20-16-6-7-17-18-10-15(22(17)21-16)13-5-3-4-12(8-13)9-19-24/h3-10,14,23-24H,2,11H2,1H3,(H,20,21)/b19-9+/t14-/m0/s1
n/an/a 52n/an/an/an/an/an/a
ManRos Therapeutics, Perharidy Research Center, 29680 Roscoff, Bretagne, France; Unité de Technologies Chimiques et Biologiques pour la Santé, Université Paris Descartes, UMR-S 1022 Inserm, 4 avenue
Curated by ChEMBL
Assay Description
Inhibition of GST tagged recombinant mouse CLK2 expressed in Escherichia coli using RS peptide as substrate after 30 mins by [gamma-33P]ATP based sci...
Eur J Med Chem 125: 696-709 (2017)
Article DOI: 10.1016/j.ejmech.2016.09.064
BindingDB Entry DOI: 10.7270/Q2M61NPG
Dual-specificity tyrosine-phosphorylation regulated kinase 1A
(Homo sapiens (Human))
BDBM50259589
(CHEMBL4065432)
Show SMILES CC[C@@H](CO)Nc1ccc2ncc(-c3cccc(\C=N\O)c3)n2n1 |r|
Show InChI InChI=1S/C17H19N5O2/c1-2-14(11-23)20-16-6-7-17-18-10-15(22(17)21-16)13-5-3-4-12(8-13)9-19-24/h3-10,14,23-24H,2,11H2,1H3,(H,20,21)/b19-9+/t14-/m0/s1
Reactome pathway
n/an/a 110n/an/an/an/an/an/a
ManRos Therapeutics, Perharidy Research Center, 29680 Roscoff, Bretagne, France; Unité de Technologies Chimiques et Biologiques pour la Santé, Université Paris Descartes, UMR-S 1022 Inserm, 4 avenue
Curated by ChEMBL
Assay Description
Inhibition of GST tagged recombinant human DYRK1A expressed in Escherichia coli using woodtide as substrate after 30 mins by [gamma-33P]ATP based sci...
Eur J Med Chem 125: 696-709 (2017)
Article DOI: 10.1016/j.ejmech.2016.09.064
BindingDB Entry DOI: 10.7270/Q2M61NPG
Dual specificity protein kinase CLK4
(Mus musculus)
BDBM50259589
(CHEMBL4065432)
Show SMILES CC[C@@H](CO)Nc1ccc2ncc(-c3cccc(\C=N\O)c3)n2n1 |r|
Show InChI InChI=1S/C17H19N5O2/c1-2-14(11-23)20-16-6-7-17-18-10-15(22(17)21-16)13-5-3-4-12(8-13)9-19-24/h3-10,14,23-24H,2,11H2,1H3,(H,20,21)/b19-9+/t14-/m0/s1
n/an/a 25n/an/an/an/an/an/a
ManRos Therapeutics, Perharidy Research Center, 29680 Roscoff, Bretagne, France; Unité de Technologies Chimiques et Biologiques pour la Santé, Université Paris Descartes, UMR-S 1022 Inserm, 4 avenue
Curated by ChEMBL
Assay Description
Inhibition of GST tagged recombinant mouse CLK4 expressed in Escherichia coli using RS peptide as substrate after 30 mins by [gamma-33P]ATP based sci...
Eur J Med Chem 125: 696-709 (2017)
Article DOI: 10.1016/j.ejmech.2016.09.064
BindingDB Entry DOI: 10.7270/Q2M61NPG
Dual specificity protein kinase CLK1
(Mus musculus)
BDBM50259589
(CHEMBL4065432)
Show SMILES CC[C@@H](CO)Nc1ccc2ncc(-c3cccc(\C=N\O)c3)n2n1 |r|
Show InChI InChI=1S/C17H19N5O2/c1-2-14(11-23)20-16-6-7-17-18-10-15(22(17)21-16)13-5-3-4-12(8-13)9-19-24/h3-10,14,23-24H,2,11H2,1H3,(H,20,21)/b19-9+/t14-/m0/s1
n/an/a 23n/an/an/an/an/an/a
ManRos Therapeutics, Perharidy Research Center, 29680 Roscoff, Bretagne, France; Unité de Technologies Chimiques et Biologiques pour la Santé, Université Paris Descartes, UMR-S 1022 Inserm, 4 avenue
Curated by ChEMBL
Assay Description
Inhibition of GST tagged recombinant mouse CLK1 expressed in Escherichia coli using RS peptide as substrate after 30 mins by [gamma-33P]ATP based sci...
Eur J Med Chem 125: 696-709 (2017)
Article DOI: 10.1016/j.ejmech.2016.09.064
BindingDB Entry DOI: 10.7270/Q2M61NPG
Cyclin-Dependent Kinase 2 (CDK2)
(Homo sapiens (Human))
BDBM50259589
(CHEMBL4065432)
Show SMILES CC[C@@H](CO)Nc1ccc2ncc(-c3cccc(\C=N\O)c3)n2n1 |r|
Show InChI InChI=1S/C17H19N5O2/c1-2-14(11-23)20-16-6-7-17-18-10-15(22(17)21-16)13-5-3-4-12(8-13)9-19-24/h3-10,14,23-24H,2,11H2,1H3,(H,20,21)/b19-9+/t14-/m0/s1
NCI pathway
Reactome pathway
n/an/a 1.40E+3n/an/an/an/an/an/a
ManRos Therapeutics, Perharidy Research Center, 29680 Roscoff, Bretagne, France; Unité de Technologies Chimiques et Biologiques pour la Santé, Université Paris Descartes, UMR-S 1022 Inserm, 4 avenue
Curated by ChEMBL
Assay Description
Inhibition of human recombinant CDK2/cyclin A after 30 mins by [gamma-33P]ATP based scintillation counting analysis
Eur J Med Chem 125: 696-709 (2017)
Article DOI: 10.1016/j.ejmech.2016.09.064
BindingDB Entry DOI: 10.7270/Q2M61NPG
Dual specificity tyrosine-phosphorylation-regulated kinase 1B
(Homo sapiens (Human))
BDBM50259589
(CHEMBL4065432)
Show SMILES CC[C@@H](CO)Nc1ccc2ncc(-c3cccc(\C=N\O)c3)n2n1 |r|
Show InChI InChI=1S/C17H19N5O2/c1-2-14(11-23)20-16-6-7-17-18-10-15(22(17)21-16)13-5-3-4-12(8-13)9-19-24/h3-10,14,23-24H,2,11H2,1H3,(H,20,21)/b19-9+/t14-/m0/s1
n/an/a 80n/an/an/an/an/an/a
ManRos Therapeutics, Perharidy Research Center, 29680 Roscoff, Bretagne, France; Unité de Technologies Chimiques et Biologiques pour la Santé, Université Paris Descartes, UMR-S 1022 Inserm, 4 avenue
Curated by ChEMBL
Assay Description
Inhibition of GST tagged recombinant human DYRK1B expressed in Escherichia coli using woodtide as substrate after 30 mins by [gamma-33P]ATP based sci...
Eur J Med Chem 125: 696-709 (2017)
Article DOI: 10.1016/j.ejmech.2016.09.064
BindingDB Entry DOI: 10.7270/Q2M61NPG
Dual-specificity tyrosine-phosphorylation regulated kinase 2
(Homo sapiens (Human))
BDBM50259589
(CHEMBL4065432)
Show SMILES CC[C@@H](CO)Nc1ccc2ncc(-c3cccc(\C=N\O)c3)n2n1 |r|
Show InChI InChI=1S/C17H19N5O2/c1-2-14(11-23)20-16-6-7-17-18-10-15(22(17)21-16)13-5-3-4-12(8-13)9-19-24/h3-10,14,23-24H,2,11H2,1H3,(H,20,21)/b19-9+/t14-/m0/s1
NCI pathway
n/an/a 390n/an/an/an/an/an/a
ManRos Therapeutics, Perharidy Research Center, 29680 Roscoff, Bretagne, France; Unité de Technologies Chimiques et Biologiques pour la Santé, Université Paris Descartes, UMR-S 1022 Inserm, 4 avenue
Curated by ChEMBL
Assay Description
Inhibition of GST tagged recombinant human DYRK2 expressed in Escherichia coli using using woodtide as substrate after 30 mins by [gamma-33P]ATP base...
Eur J Med Chem 125: 696-709 (2017)
Article DOI: 10.1016/j.ejmech.2016.09.064
BindingDB Entry DOI: 10.7270/Q2M61NPG
Cyclin-Dependent Kinase 9 (CDK9)
(Homo sapiens (Human))
BDBM50259589
(CHEMBL4065432)
Show SMILES CC[C@@H](CO)Nc1ccc2ncc(-c3cccc(\C=N\O)c3)n2n1 |r|
Show InChI InChI=1S/C17H19N5O2/c1-2-14(11-23)20-16-6-7-17-18-10-15(22(17)21-16)13-5-3-4-12(8-13)9-19-24/h3-10,14,23-24H,2,11H2,1H3,(H,20,21)/b19-9+/t14-/m0/s1
Reactome pathway
n/an/a 2.00E+3n/an/an/an/an/an/a
ManRos Therapeutics, Perharidy Research Center, 29680 Roscoff, Bretagne, France; Unité de Technologies Chimiques et Biologiques pour la Santé, Université Paris Descartes, UMR-S 1022 Inserm, 4 avenue
Curated by ChEMBL
Assay Description
Inhibition of human recombinant CDK9/cyclin T expressed in insect cells using CDK7/9-tide as substrate after 30 mins by [gamma-33P]ATP based scintill...
Eur J Med Chem 125: 696-709 (2017)
Article DOI: 10.1016/j.ejmech.2016.09.064
BindingDB Entry DOI: 10.7270/Q2M61NPG
Cyclin-Dependent Kinase 5 (CDK5)
(Homo sapiens (Human))
BDBM50259589
(CHEMBL4065432)
Show SMILES CC[C@@H](CO)Nc1ccc2ncc(-c3cccc(\C=N\O)c3)n2n1 |r|
Show InChI InChI=1S/C17H19N5O2/c1-2-14(11-23)20-16-6-7-17-18-10-15(22(17)21-16)13-5-3-4-12(8-13)9-19-24/h3-10,14,23-24H,2,11H2,1H3,(H,20,21)/b19-9+/t14-/m0/s1
NCI pathway
Reactome pathway
n/an/a 1.00E+3n/an/an/an/an/an/a
ManRos Therapeutics, Perharidy Research Center, 29680 Roscoff, Bretagne, France; Unité de Technologies Chimiques et Biologiques pour la Santé, Université Paris Descartes, UMR-S 1022 Inserm, 4 avenue
Curated by ChEMBL
Assay Description
Inhibition of human recombinant CDK5/p25 after 30 mins by [gamma-33P]ATP based scintillation counting analysis
Eur J Med Chem 125: 696-709 (2017)
Article DOI: 10.1016/j.ejmech.2016.09.064
BindingDB Entry DOI: 10.7270/Q2M61NPG
Dual specificity protein kinase CLK3
(Mus musculus)
BDBM50259589
(CHEMBL4065432)
Show SMILES CC[C@@H](CO)Nc1ccc2ncc(-c3cccc(\C=N\O)c3)n2n1 |r|
Show InChI InChI=1S/C17H19N5O2/c1-2-14(11-23)20-16-6-7-17-18-10-15(22(17)21-16)13-5-3-4-12(8-13)9-19-24/h3-10,14,23-24H,2,11H2,1H3,(H,20,21)/b19-9+/t14-/m0/s1
n/an/a 1.40E+3n/an/an/an/an/an/a
ManRos Therapeutics, Perharidy Research Center, 29680 Roscoff, Bretagne, France; Unité de Technologies Chimiques et Biologiques pour la Santé, Université Paris Descartes, UMR-S 1022 Inserm, 4 avenue
Curated by ChEMBL
Assay Description
Inhibition of GST tagged recombinant mouse CLK3 expressed in Escherichia coli using RS peptide as substrate after 30 mins by [gamma-33P]ATP based sci...
Eur J Med Chem 125: 696-709 (2017)
Article DOI: 10.1016/j.ejmech.2016.09.064
BindingDB Entry DOI: 10.7270/Q2M61NPG