BDBM50259611 CHEMBL467114::sodium 6-(5-chloro-2-(4-chloro-2-fluorobenzyloxy)benzyl)picolinate
SMILES: [O-]C(=O)c1cccc(Cc2cc(Cl)ccc2OCc2ccc(Cl)cc2F)n1
InChI Key: InChIKey=HJPAXYLYYQIFCK-UHFFFAOYSA-M
Data: 2 KI  11 IC50  1 Kd
Activity Spreadsheet -- Enzyme Inhibition Constant Data from BindingDB
Found 14 hits for monomerid = 50259611
Trg + Lig
Ki
nM
ΔG°
kcal/mole
IC50
nM
Kd
nM
EC50/IC50
nM
koff
s-1
kon
M-1s-1
pHTemp
°C
Prostaglandin E2 receptor EP1 subtype (EP1)
(Homo sapiens (Human))
BDBM50259611
(CHEMBL467114 | sodium 6-(5-chloro-2-(4-chloro-2-fl...)
Show SMILES [O-]C(=O)c1cccc(Cc2cc(Cl)ccc2OCc2ccc(Cl)cc2F)n1
Show InChI InChI=1S/C20H14Cl2FNO3/c21-14-6-7-19(27-11-12-4-5-15(22)10-17(12)23)13(8-14)9-16-2-1-3-18(24-16)20(25)26/h1-8,10H,9,11H2,(H,25,26)/p-1
7.94n/an/an/an/an/an/an/an/a
GlaxoSmithKline
Curated by ChEMBL
Assay Description
Antagonist activity at human recombinant EP1 receptor expressed in CHO cells assessed as inhibition of PGE2-mediated intracellular calcium mobilizati...
Bioorg Med Chem Lett 19: 2599-603 (2009)
Article DOI: 10.1016/j.bmcl.2009.02.112
BindingDB Entry DOI: 10.7270/Q2HT2P68
Prostanoid TP receptor
(Homo sapiens (Human))
BDBM50259611
(CHEMBL467114 | sodium 6-(5-chloro-2-(4-chloro-2-fl...)
Show SMILES [O-]C(=O)c1cccc(Cc2cc(Cl)ccc2OCc2ccc(Cl)cc2F)n1
Show InChI InChI=1S/C20H14Cl2FNO3/c21-14-6-7-19(27-11-12-4-5-15(22)10-17(12)23)13(8-14)9-16-2-1-3-18(24-16)20(25)26/h1-8,10H,9,11H2,(H,25,26)/p-1
10n/an/an/an/an/an/an/an/a
GlaxoSmithKline
Curated by ChEMBL
Assay Description
Inhibition of TP receptor
Bioorg Med Chem Lett 19: 2599-603 (2009)
Article DOI: 10.1016/j.bmcl.2009.02.112
BindingDB Entry DOI: 10.7270/Q2HT2P68
Cytochrome P450 2C19
(Homo sapiens (Human))
BDBM50259611
(CHEMBL467114 | sodium 6-(5-chloro-2-(4-chloro-2-fl...)
Show SMILES [O-]C(=O)c1cccc(Cc2cc(Cl)ccc2OCc2ccc(Cl)cc2F)n1
Show InChI InChI=1S/C20H14Cl2FNO3/c21-14-6-7-19(27-11-12-4-5-15(22)10-17(12)23)13(8-14)9-16-2-1-3-18(24-16)20(25)26/h1-8,10H,9,11H2,(H,25,26)/p-1
Reactome pathway
n/an/a 8.50E+4n/an/an/an/an/an/a
GlaxoSmithKline
Curated by ChEMBL
Assay Description
Inhibition of human CYP2C19
Bioorg Med Chem Lett 19: 2599-603 (2009)
Article DOI: 10.1016/j.bmcl.2009.02.112
BindingDB Entry DOI: 10.7270/Q2HT2P68
Cytochrome P450 2C9
(Homo sapiens (Human))
BDBM50259611
(CHEMBL467114 | sodium 6-(5-chloro-2-(4-chloro-2-fl...)
Show SMILES [O-]C(=O)c1cccc(Cc2cc(Cl)ccc2OCc2ccc(Cl)cc2F)n1
Show InChI InChI=1S/C20H14Cl2FNO3/c21-14-6-7-19(27-11-12-4-5-15(22)10-17(12)23)13(8-14)9-16-2-1-3-18(24-16)20(25)26/h1-8,10H,9,11H2,(H,25,26)/p-1
Reactome pathway
n/an/a 8.00E+3n/an/an/an/an/an/a
GlaxoSmithKline
Curated by ChEMBL
Assay Description
Inhibition of human CYP2C9
Bioorg Med Chem Lett 19: 2599-603 (2009)
Article DOI: 10.1016/j.bmcl.2009.02.112
BindingDB Entry DOI: 10.7270/Q2HT2P68
Cytochrome P450 2D6
(Homo sapiens (Human))
BDBM50259611
(CHEMBL467114 | sodium 6-(5-chloro-2-(4-chloro-2-fl...)
Show SMILES [O-]C(=O)c1cccc(Cc2cc(Cl)ccc2OCc2ccc(Cl)cc2F)n1
Show InChI InChI=1S/C20H14Cl2FNO3/c21-14-6-7-19(27-11-12-4-5-15(22)10-17(12)23)13(8-14)9-16-2-1-3-18(24-16)20(25)26/h1-8,10H,9,11H2,(H,25,26)/p-1
n/an/a>1.00E+5n/an/an/an/an/an/a
GlaxoSmithKline
Curated by ChEMBL
Assay Description
Inhibition of human CYP2D6
Bioorg Med Chem Lett 19: 2599-603 (2009)
Article DOI: 10.1016/j.bmcl.2009.02.112
BindingDB Entry DOI: 10.7270/Q2HT2P68
Prostaglandin E2 receptor EP1 subtype (EP1)
(Homo sapiens (Human))
BDBM50259611
(CHEMBL467114 | sodium 6-(5-chloro-2-(4-chloro-2-fl...)
Show SMILES [O-]C(=O)c1cccc(Cc2cc(Cl)ccc2OCc2ccc(Cl)cc2F)n1
Show InChI InChI=1S/C20H14Cl2FNO3/c21-14-6-7-19(27-11-12-4-5-15(22)10-17(12)23)13(8-14)9-16-2-1-3-18(24-16)20(25)26/h1-8,10H,9,11H2,(H,25,26)/p-1
n/an/an/a 7.94n/an/an/an/an/a
GlaxoSmithKline
Curated by ChEMBL
Assay Description
Antagonist activity at human recombinant EP1 receptor expressed in CHO cells assessed as luciferase activity by Schild assay
Bioorg Med Chem Lett 19: 2599-603 (2009)
Article DOI: 10.1016/j.bmcl.2009.02.112
BindingDB Entry DOI: 10.7270/Q2HT2P68
Prostaglandin E2 receptor
(Homo sapiens (Human))
BDBM50259611
(CHEMBL467114 | sodium 6-(5-chloro-2-(4-chloro-2-fl...)
Show SMILES [O-]C(=O)c1cccc(Cc2cc(Cl)ccc2OCc2ccc(Cl)cc2F)n1
Show InChI InChI=1S/C20H14Cl2FNO3/c21-14-6-7-19(27-11-12-4-5-15(22)10-17(12)23)13(8-14)9-16-2-1-3-18(24-16)20(25)26/h1-8,10H,9,11H2,(H,25,26)/p-1
n/an/a 1.26E+3n/an/an/an/an/an/a
GlaxoSmithKline
Curated by ChEMBL
Assay Description
Inhibition of EP3 receptor by FLIPR assay
Bioorg Med Chem Lett 19: 2599-603 (2009)
Article DOI: 10.1016/j.bmcl.2009.02.112
BindingDB Entry DOI: 10.7270/Q2HT2P68
Prostaglandin F2-alpha receptor
(Homo sapiens (Human))
BDBM50259611
(CHEMBL467114 | sodium 6-(5-chloro-2-(4-chloro-2-fl...)
Show SMILES [O-]C(=O)c1cccc(Cc2cc(Cl)ccc2OCc2ccc(Cl)cc2F)n1
Show InChI InChI=1S/C20H14Cl2FNO3/c21-14-6-7-19(27-11-12-4-5-15(22)10-17(12)23)13(8-14)9-16-2-1-3-18(24-16)20(25)26/h1-8,10H,9,11H2,(H,25,26)/p-1
n/an/a>1.00E+4n/an/an/an/an/an/a
GlaxoSmithKline
Curated by ChEMBL
Assay Description
Inhibition of FP receptor
Bioorg Med Chem Lett 19: 2599-603 (2009)
Article DOI: 10.1016/j.bmcl.2009.02.112
BindingDB Entry DOI: 10.7270/Q2HT2P68
Prostanoid IP receptor
(Homo sapiens (Human))
BDBM50259611
(CHEMBL467114 | sodium 6-(5-chloro-2-(4-chloro-2-fl...)
Show SMILES [O-]C(=O)c1cccc(Cc2cc(Cl)ccc2OCc2ccc(Cl)cc2F)n1
Show InChI InChI=1S/C20H14Cl2FNO3/c21-14-6-7-19(27-11-12-4-5-15(22)10-17(12)23)13(8-14)9-16-2-1-3-18(24-16)20(25)26/h1-8,10H,9,11H2,(H,25,26)/p-1
NCI pathway
Reactome pathway
n/an/a>1.00E+3n/an/an/an/an/an/a
GlaxoSmithKline
Curated by ChEMBL
Assay Description
Inhibition of IP receptor
Bioorg Med Chem Lett 19: 2599-603 (2009)
Article DOI: 10.1016/j.bmcl.2009.02.112
BindingDB Entry DOI: 10.7270/Q2HT2P68
Prostaglandin E2 receptor EP4 subtype
(Homo sapiens (Human))
BDBM50259611
(CHEMBL467114 | sodium 6-(5-chloro-2-(4-chloro-2-fl...)
Show SMILES [O-]C(=O)c1cccc(Cc2cc(Cl)ccc2OCc2ccc(Cl)cc2F)n1
Show InChI InChI=1S/C20H14Cl2FNO3/c21-14-6-7-19(27-11-12-4-5-15(22)10-17(12)23)13(8-14)9-16-2-1-3-18(24-16)20(25)26/h1-8,10H,9,11H2,(H,25,26)/p-1
Reactome pathway
n/an/a>3.16E+4n/an/an/an/an/an/a
GlaxoSmithKline
Curated by ChEMBL
Assay Description
Inhibition of EP4 receptor
Bioorg Med Chem Lett 19: 2599-603 (2009)
Article DOI: 10.1016/j.bmcl.2009.02.112
BindingDB Entry DOI: 10.7270/Q2HT2P68
Prostaglandin E2 receptor EP1 subtype (EP1)
(Homo sapiens (Human))
BDBM50259611
(CHEMBL467114 | sodium 6-(5-chloro-2-(4-chloro-2-fl...)
Show SMILES [O-]C(=O)c1cccc(Cc2cc(Cl)ccc2OCc2ccc(Cl)cc2F)n1
Show InChI InChI=1S/C20H14Cl2FNO3/c21-14-6-7-19(27-11-12-4-5-15(22)10-17(12)23)13(8-14)9-16-2-1-3-18(24-16)20(25)26/h1-8,10H,9,11H2,(H,25,26)/p-1
n/an/a 12.6n/an/an/an/an/an/a
GlaxoSmithKline
Curated by ChEMBL
Assay Description
Displacement of [3H]PGE2 from human EP1 receptor expressed in CHO cells
Bioorg Med Chem Lett 19: 2599-603 (2009)
Article DOI: 10.1016/j.bmcl.2009.02.112
BindingDB Entry DOI: 10.7270/Q2HT2P68
Cytochrome P450 1A
(Homo sapiens (Human))
BDBM50259611
(CHEMBL467114 | sodium 6-(5-chloro-2-(4-chloro-2-fl...)
Show SMILES [O-]C(=O)c1cccc(Cc2cc(Cl)ccc2OCc2ccc(Cl)cc2F)n1
Show InChI InChI=1S/C20H14Cl2FNO3/c21-14-6-7-19(27-11-12-4-5-15(22)10-17(12)23)13(8-14)9-16-2-1-3-18(24-16)20(25)26/h1-8,10H,9,11H2,(H,25,26)/p-1
Reactome pathway
n/an/a 2.00E+4n/an/an/an/an/an/a
GlaxoSmithKline
Curated by ChEMBL
Assay Description
Inhibition of human CYP1A2
Bioorg Med Chem Lett 19: 2599-603 (2009)
Article DOI: 10.1016/j.bmcl.2009.02.112
BindingDB Entry DOI: 10.7270/Q2HT2P68
Potassium voltage-gated channel subfamily H member 2
(Homo sapiens (Human))
BDBM50259611
(CHEMBL467114 | sodium 6-(5-chloro-2-(4-chloro-2-fl...)
Show SMILES [O-]C(=O)c1cccc(Cc2cc(Cl)ccc2OCc2ccc(Cl)cc2F)n1
Show InChI InChI=1S/C20H14Cl2FNO3/c21-14-6-7-19(27-11-12-4-5-15(22)10-17(12)23)13(8-14)9-16-2-1-3-18(24-16)20(25)26/h1-8,10H,9,11H2,(H,25,26)/p-1
Reactome pathway
n/an/a>3.16E+4n/an/an/an/an/an/a
GlaxoSmithKline
Curated by ChEMBL
Assay Description
Inhibition of human ERG channel
Bioorg Med Chem Lett 19: 2599-603 (2009)
Article DOI: 10.1016/j.bmcl.2009.02.112
BindingDB Entry DOI: 10.7270/Q2HT2P68
Prostaglandin E2 receptor EP2 subtype
(Homo sapiens (Human))
BDBM50259611
(CHEMBL467114 | sodium 6-(5-chloro-2-(4-chloro-2-fl...)
Show SMILES [O-]C(=O)c1cccc(Cc2cc(Cl)ccc2OCc2ccc(Cl)cc2F)n1
Show InChI InChI=1S/C20H14Cl2FNO3/c21-14-6-7-19(27-11-12-4-5-15(22)10-17(12)23)13(8-14)9-16-2-1-3-18(24-16)20(25)26/h1-8,10H,9,11H2,(H,25,26)/p-1
Reactome pathway
n/an/a 1.58E+3n/an/an/an/an/an/a
GlaxoSmithKline
Curated by ChEMBL
Assay Description
Inhibition of EP2 receptor
Bioorg Med Chem Lett 19: 2599-603 (2009)
Article DOI: 10.1016/j.bmcl.2009.02.112
BindingDB Entry DOI: 10.7270/Q2HT2P68