BDBM50259922 CHEMBL505589::Cyclotheonamide E2
SMILES: [#6]-[#6]-[#6@H](-[#6])-[#6@H]-1-[#7]-[#6](=O)-[#6](=O)-[#6@H](-[#6]-[#6]-[#6]\[#7]=[#6](\[#7])-[#7])-[#7]-[#6](=O)-[#6@@H]-2-[#6]-[#6]-[#6]-[#7]-2-[#6](=O)-[#6@H](-[#6]-[#7]-[#6](=O)\[#6]=[#6]\[#6@H](-[#6]-c2ccc(-[#8])cc2)-[#7]-[#6]-1=O)-[#7]-[#6](=O)-[#6@H](-[#6])-[#7]-[#6](=O)-c1ccccc1
InChI Key: InChIKey=YSNKBNIOHORIHX-MSQPAANESA-N
Data: 1 IC50
Activity Spreadsheet -- Enzyme Inhibition Constant Data from BindingDB
Found 1 hit for monomerid = 50259922
Trg + Lig
Ki
nM
ΔG°
kcal/mole
IC50
nM
Kd
nM
EC50/IC50
nM
koff
s-1
kon
M-1s-1
pHTemp
°C
Prothrombin
(Homo sapiens (Human))
BDBM50259922
(CHEMBL505589 | Cyclotheonamide E2)
Show SMILES [#6]-[#6]-[#6@H](-[#6])-[#6@H]-1-[#7]-[#6](=O)-[#6](=O)-[#6@H](-[#6]-[#6]-[#6]\[#7]=[#6](\[#7])-[#7])-[#7]-[#6](=O)-[#6@@H]-2-[#6]-[#6]-[#6]-[#7]-2-[#6](=O)-[#6@H](-[#6]-[#7]-[#6](=O)\[#6]=[#6]\[#6@H](-[#6]-c2ccc(-[#8])cc2)-[#7]-[#6]-1=O)-[#7]-[#6](=O)-[#6@H](-[#6])-[#7]-[#6](=O)-c1ccccc1 |r,t:34|
Show InChI InChI=1S/C42H56N10O9/c1-4-24(2)34-39(59)48-28(22-26-14-17-29(53)18-15-26)16-19-33(54)46-23-31(50-36(56)25(3)47-37(57)27-10-6-5-7-11-27)41(61)52-21-9-13-32(52)38(58)49-30(35(55)40(60)51-34)12-8-20-45-42(43)44/h5-7,10-11,14-19,24-25,28,30-32,34,53H,4,8-9,12-13,20-23H2,1-3H3,(H,46,54)(H,47,57)(H,48,59)(H,49,58)(H,50,56)(H,51,60)(H4,43,44,45)/b19-16+/t24-,25-,28+,30-,31-,32-,34+/m0/s1
n/an/a 13n/an/an/an/an/an/a
The University of Tokyo
Curated by ChEMBL
Assay Description
Inhibition of thrombin
J Nat Prod 61: 667-70 (1998)
Article DOI: 10.1021/np970544n
BindingDB Entry DOI: 10.7270/Q2GB24XX