BDBM50259971 CHEMBL4064148
SMILES: C[C@]1(CCSC(N)=N1)c1cc(CNCC2CC2)c(F)cc1F
InChI Key: InChIKey=YWBPXKGASACQGY-INIZCTEOSA-N
Data: 5 IC50
Activity Spreadsheet -- Enzyme Inhibition Constant Data from BindingDB
Found 5 hits for monomerid = 50259971
Trg + Lig
Ki
nM
ΔG°
kcal/mole
IC50
nM
Kd
nM
EC50/IC50
nM
koff
s-1
kon
M-1s-1
pHTemp
°C
Beta-secretase 1
(Homo sapiens (Human))
BDBM50259971
(CHEMBL4064148)
Show SMILES C[C@]1(CCSC(N)=N1)c1cc(CNCC2CC2)c(F)cc1F |r,c:6|
Show InChI InChI=1S/C16H21F2N3S/c1-16(4-5-22-15(19)21-16)12-6-11(13(17)7-14(12)18)9-20-8-10-2-3-10/h6-7,10,20H,2-5,8-9H2,1H3,(H2,19,21)/t16-/m0/s1
n/an/a 14n/an/an/an/an/an/a
The Scripps Research Institute
Curated by ChEMBL
Assay Description
Inhibition of BACE1 in human H4 cells expressing wild type APP695 assessed as reduction in soluble APPbeta level after 18 hrs by ELISA
J Med Chem 60: 386-402 (2017)
Article DOI: 10.1021/acs.jmedchem.6b01451
BindingDB Entry DOI: 10.7270/Q2154KHX
Beta-secretase 2
(Homo sapiens (Human))
BDBM50259971
(CHEMBL4064148)
Show SMILES C[C@]1(CCSC(N)=N1)c1cc(CNCC2CC2)c(F)cc1F |r,c:6|
Show InChI InChI=1S/C16H21F2N3S/c1-16(4-5-22-15(19)21-16)12-6-11(13(17)7-14(12)18)9-20-8-10-2-3-10/h6-7,10,20H,2-5,8-9H2,1H3,(H2,19,21)/t16-/m0/s1
n/an/a 3.59E+4n/an/an/an/an/an/a
The Scripps Research Institute
Curated by ChEMBL
Assay Description
Inhibition of BACE2 (unknown origin) by cell free assay
J Med Chem 60: 386-402 (2017)
Article DOI: 10.1021/acs.jmedchem.6b01451
BindingDB Entry DOI: 10.7270/Q2154KHX
Potassium voltage-gated channel subfamily H member 2
(Homo sapiens (Human))
BDBM50259971
(CHEMBL4064148)
Show SMILES C[C@]1(CCSC(N)=N1)c1cc(CNCC2CC2)c(F)cc1F |r,c:6|
Show InChI InChI=1S/C16H21F2N3S/c1-16(4-5-22-15(19)21-16)12-6-11(13(17)7-14(12)18)9-20-8-10-2-3-10/h6-7,10,20H,2-5,8-9H2,1H3,(H2,19,21)/t16-/m0/s1
Reactome pathway
n/an/a 3.30E+4n/an/an/an/an/an/a
The Scripps Research Institute
Curated by ChEMBL
Assay Description
Inhibition of human ERG expressed in CHO cells at -80 mV holding potential after 5 mins by patch clamp assay
J Med Chem 60: 386-402 (2017)
Article DOI: 10.1021/acs.jmedchem.6b01451
BindingDB Entry DOI: 10.7270/Q2154KHX
Beta-secretase 1
(Homo sapiens (Human))
BDBM50259971
(CHEMBL4064148)
Show SMILES C[C@]1(CCSC(N)=N1)c1cc(CNCC2CC2)c(F)cc1F |r,c:6|
Show InChI InChI=1S/C16H21F2N3S/c1-16(4-5-22-15(19)21-16)12-6-11(13(17)7-14(12)18)9-20-8-10-2-3-10/h6-7,10,20H,2-5,8-9H2,1H3,(H2,19,21)/t16-/m0/s1
n/an/a 1.54E+4n/an/an/an/an/an/a
The Scripps Research Institute
Curated by ChEMBL
Assay Description
Inhibition of BACE1 (unknown origin) using biotin-GLTNIKTEEISEISYEVEFR-C[oregon green]KK-OH as substrate after 3 hrs by fluorescence polarization ass...
J Med Chem 60: 386-402 (2017)
Article DOI: 10.1021/acs.jmedchem.6b01451
BindingDB Entry DOI: 10.7270/Q2154KHX
Cathepsin D
(Homo sapiens (Human))
BDBM50259971
(CHEMBL4064148)
Show SMILES C[C@]1(CCSC(N)=N1)c1cc(CNCC2CC2)c(F)cc1F |r,c:6|
Show InChI InChI=1S/C16H21F2N3S/c1-16(4-5-22-15(19)21-16)12-6-11(13(17)7-14(12)18)9-20-8-10-2-3-10/h6-7,10,20H,2-5,8-9H2,1H3,(H2,19,21)/t16-/m0/s1
NCI pathway
Reactome pathway
n/an/a>1.00E+5n/an/an/an/an/an/a
The Scripps Research Institute
Curated by ChEMBL
Assay Description
Inhibition of Cathepsin D (unknown origin) by cell free assay
J Med Chem 60: 386-402 (2017)
Article DOI: 10.1021/acs.jmedchem.6b01451
BindingDB Entry DOI: 10.7270/Q2154KHX