null
SMILES: C[C@]1(CCSC(N)=N1)c1cc(CNC23CC(C2)C3)c(F)cc1F
InChI Key: InChIKey=TYGINIZGIMDBFT-KJWVSFLRSA-N
Activity Spreadsheet -- Enzyme Inhibition Constant Data from BindingDB
Found 4 hits for monomerid = 50259974
Trg + Lig
Ki
nM
ΔG°
kcal/mole
IC50
nM
Kd
nM
EC50/IC50
nM
koff
s-1
kon
M-1s-1
pHTemp
°C
Cathepsin D
(Homo sapiens (Human))
BDBM50259974
(CHEMBL4102593)
Show SMILES C[C@]1(CCSC(N)=N1)c1cc(CNC23CC(C2)C3)c(F)cc1F |r,c:6|
Show InChI InChI=1S/C17H21F2N3S/c1-16(2-3-23-15(20)22-16)12-4-11(13(18)5-14(12)19)9-21-17-6-10(7-17)8-17/h4-5,10,21H,2-3,6-9H2,1H3,(H2,20,22)/t10?,16-,17?/m0/s1
NCI pathway
Reactome pathway
n/an/a 9.53E+4n/an/an/an/an/an/a
The Scripps Research Institute
Curated by ChEMBL
Assay Description
Inhibition of Cathepsin D (unknown origin) by cell free assay
J Med Chem 60: 386-402 (2017)
Article DOI: 10.1021/acs.jmedchem.6b01451
BindingDB Entry DOI: 10.7270/Q2154KHX
Beta-secretase 1
(Homo sapiens (Human))
BDBM50259974
(CHEMBL4102593)
Show SMILES C[C@]1(CCSC(N)=N1)c1cc(CNC23CC(C2)C3)c(F)cc1F |r,c:6|
Show InChI InChI=1S/C17H21F2N3S/c1-16(2-3-23-15(20)22-16)12-4-11(13(18)5-14(12)19)9-21-17-6-10(7-17)8-17/h4-5,10,21H,2-3,6-9H2,1H3,(H2,20,22)/t10?,16-,17?/m0/s1
n/an/a 4n/an/an/an/an/an/a
The Scripps Research Institute
Curated by ChEMBL
Assay Description
Inhibition of BACE1 in human H4 cells expressing wild type APP695 assessed as reduction in soluble APPbeta level after 18 hrs by ELISA
J Med Chem 60: 386-402 (2017)
Article DOI: 10.1021/acs.jmedchem.6b01451
BindingDB Entry DOI: 10.7270/Q2154KHX
Beta-secretase 2
(Homo sapiens (Human))
BDBM50259974
(CHEMBL4102593)
Show SMILES C[C@]1(CCSC(N)=N1)c1cc(CNC23CC(C2)C3)c(F)cc1F |r,c:6|
Show InChI InChI=1S/C17H21F2N3S/c1-16(2-3-23-15(20)22-16)12-4-11(13(18)5-14(12)19)9-21-17-6-10(7-17)8-17/h4-5,10,21H,2-3,6-9H2,1H3,(H2,20,22)/t10?,16-,17?/m0/s1
n/an/a 1.75E+4n/an/an/an/an/an/a
The Scripps Research Institute
Curated by ChEMBL
Assay Description
Inhibition of BACE2 (unknown origin) by cell free assay
J Med Chem 60: 386-402 (2017)
Article DOI: 10.1021/acs.jmedchem.6b01451
BindingDB Entry DOI: 10.7270/Q2154KHX
Beta-secretase 1
(Homo sapiens (Human))
BDBM50259974
(CHEMBL4102593)
Show SMILES C[C@]1(CCSC(N)=N1)c1cc(CNC23CC(C2)C3)c(F)cc1F |r,c:6|
Show InChI InChI=1S/C17H21F2N3S/c1-16(2-3-23-15(20)22-16)12-4-11(13(18)5-14(12)19)9-21-17-6-10(7-17)8-17/h4-5,10,21H,2-3,6-9H2,1H3,(H2,20,22)/t10?,16-,17?/m0/s1
n/an/a 2.10E+3n/an/an/an/an/an/a
The Scripps Research Institute
Curated by ChEMBL
Assay Description
Inhibition of BACE1 (unknown origin) using biotin-GLTNIKTEEISEISYEVEFR-C[oregon green]KK-OH as substrate after 3 hrs by fluorescence polarization ass...
J Med Chem 60: 386-402 (2017)
Article DOI: 10.1021/acs.jmedchem.6b01451
BindingDB Entry DOI: 10.7270/Q2154KHX