BDBM50260057 (-)-4'-O-methylepigallocatechin::CHEMBL485460::ouratea-catechin
SMILES: COc1c(O)cc(cc1O)[C@H]1Oc2cc(O)cc(O)c2C[C@H]1O
InChI Key: InChIKey=ITDYPNOEEHONAH-UKRRQHHQSA-N
Data: 2 IC50
Activity Spreadsheet -- Enzyme Inhibition Constant Data from BindingDB
Found 2 hits for monomerid = 50260057
Trg + Lig
Ki
nM
ΔG°
kcal/mole
IC50
nM
Kd
nM
EC50/IC50
nM
koff
s-1
kon
M-1s-1
pHTemp
°C
Cyclooxygenase-1 (COX-1)
(Homo sapiens (Human))
BDBM50260057
((-)-4'-O-methylepigallocatechin | CHEMBL485460 | o...)
Show SMILES COc1c(O)cc(cc1O)[C@H]1Oc2cc(O)cc(O)c2C[C@H]1O |r|
Show InChI InChI=1S/C16H16O7/c1-22-16-11(19)2-7(3-12(16)20)15-13(21)6-9-10(18)4-8(17)5-14(9)23-15/h2-5,13,15,17-21H,6H2,1H3/t13-,15-/m1/s1
n/an/a 3.30E+3n/an/an/an/an/an/a
Uppsala University
Curated by ChEMBL
Assay Description
Inhibition of COX1
J Nat Prod 68: 985-91 (2005)
Article DOI: 10.1021/np049655u
BindingDB Entry DOI: 10.7270/Q27S7PN5
Mitogen-activated protein kinase 14
(Homo sapiens (Human))
BDBM50260057
((-)-4'-O-methylepigallocatechin | CHEMBL485460 | o...)
Show SMILES COc1c(O)cc(cc1O)[C@H]1Oc2cc(O)cc(O)c2C[C@H]1O |r|
Show InChI InChI=1S/C16H16O7/c1-22-16-11(19)2-7(3-12(16)20)15-13(21)6-9-10(18)4-8(17)5-14(9)23-15/h2-5,13,15,17-21H,6H2,1H3/t13-,15-/m1/s1
NCI pathway
Reactome pathway
n/an/a 3.92E+4n/an/an/an/an/an/a
Albert-Ludwigs-Universita£t
Curated by ChEMBL
Assay Description
Inhibition of p38alpha after 1 hr by ELISA
J Nat Prod 73: 2035-41 (2010)
Article DOI: 10.1021/np100523s
BindingDB Entry DOI: 10.7270/Q29P31XZ