BDBM50260143 CHEMBL4087244
SMILES: Fc1ccc(cc1C(=O)NCc1cn[nH]c1)[C@@H]1CCNC[C@H]1COc1ccc2OCOc2c1
InChI Key: InChIKey=SVTCQZQJVRGTTA-HKUYNNGSSA-N
Data: 3 IC50
Activity Spreadsheet -- Enzyme Inhibition Constant Data from BindingDB
Found 3 hits for monomerid = 50260143
Trg + Lig
Ki
nM
ΔG°
kcal/mole
IC50
nM
Kd
nM
EC50/IC50
nM
koff
s-1
kon
M-1s-1
pHTemp
°C
Rhodopsin kinase
(Bos taurus)
BDBM50260143
(CHEMBL4087244)
Show SMILES Fc1ccc(cc1C(=O)NCc1cn[nH]c1)[C@@H]1CCNC[C@H]1COc1ccc2OCOc2c1 |r|
Show InChI InChI=1S/C24H25FN4O4/c25-21-3-1-16(7-20(21)24(30)27-9-15-10-28-29-11-15)19-5-6-26-12-17(19)13-31-18-2-4-22-23(8-18)33-14-32-22/h1-4,7-8,10-11,17,19,26H,5-6,9,12-14H2,(H,27,30)(H,28,29)/t17-,19-/m0/s1
n/an/a>1.00E+5n/an/an/an/an/an/a
Department of Medicinal Chemistry, College of Pharmacy,?Departments of Pharmacology and Biological Chemistry, Life Sciences Institute,§Ph.D. Program in Chemical Biology,?Vahlteich Medicinal Chemistry
Curated by ChEMBL
Assay Description
Inhibition of bovine GRK1 (1 to 535 residues) after 5 mins after 5 mins in presence of ATP by phosphorimaging assay
J Med Chem 60: 3052-3069 (2017)
Article DOI: 10.1021/acs.jmedchem.7b00112
BindingDB Entry DOI: 10.7270/Q2M047XQ
Beta-adrenergic receptor kinase 1
(Bos taurus)
BDBM50260143
(CHEMBL4087244)
Show SMILES Fc1ccc(cc1C(=O)NCc1cn[nH]c1)[C@@H]1CCNC[C@H]1COc1ccc2OCOc2c1 |r|
Show InChI InChI=1S/C24H25FN4O4/c25-21-3-1-16(7-20(21)24(30)27-9-15-10-28-29-11-15)19-5-6-26-12-17(19)13-31-18-2-4-22-23(8-18)33-14-32-22/h1-4,7-8,10-11,17,19,26H,5-6,9,12-14H2,(H,27,30)(H,28,29)/t17-,19-/m0/s1
n/an/a 390n/an/an/an/an/an/a
Department of Medicinal Chemistry, College of Pharmacy,?Departments of Pharmacology and Biological Chemistry, Life Sciences Institute,§Ph.D. Program in Chemical Biology,?Vahlteich Medicinal Chemistry
Curated by ChEMBL
Assay Description
Inhibition of bovine GRK2 S670A mutant after 5 mins in presence of ATP by phosphorimaging assay
J Med Chem 60: 3052-3069 (2017)
Article DOI: 10.1021/acs.jmedchem.7b00112
BindingDB Entry DOI: 10.7270/Q2M047XQ
G protein-coupled receptor kinase 5
(Bos taurus)
BDBM50260143
(CHEMBL4087244)
Show SMILES Fc1ccc(cc1C(=O)NCc1cn[nH]c1)[C@@H]1CCNC[C@H]1COc1ccc2OCOc2c1 |r|
Show InChI InChI=1S/C24H25FN4O4/c25-21-3-1-16(7-20(21)24(30)27-9-15-10-28-29-11-15)19-5-6-26-12-17(19)13-31-18-2-4-22-23(8-18)33-14-32-22/h1-4,7-8,10-11,17,19,26H,5-6,9,12-14H2,(H,27,30)(H,28,29)/t17-,19-/m0/s1
n/an/a>1.00E+5n/an/an/an/an/an/a
Department of Medicinal Chemistry, College of Pharmacy,?Departments of Pharmacology and Biological Chemistry, Life Sciences Institute,§Ph.D. Program in Chemical Biology,?Vahlteich Medicinal Chemistry
Curated by ChEMBL
Assay Description
Binding affinity towards serotonin transporter determined using [3H]paroxetine as radioligand
J Med Chem 60: 3052-3069 (2017)
Article DOI: 10.1021/acs.jmedchem.7b00112
BindingDB Entry DOI: 10.7270/Q2M047XQ