null
SMILES: COc1cc(OC)c(Cl)c(N2Cc3cnc(Nc4cc(F)cc(F)c4)nc3N(C3CCN(CC3)C(=O)\C=C\CN(C)C)C2=O)c1Cl
InChI Key: InChIKey=UMIVIWIXPXKSIW-AATRIKPKSA-N
Activity Spreadsheet -- Enzyme Inhibition Constant Data from BindingDB
Found 1 hit for monomerid = 50260199
Trg + Lig
Ki
nM
ΔG°
kcal/mole
IC50
nM
Kd
nM
EC50/IC50
nM
koff
s-1
kon
M-1s-1
pHTemp
°C
Fibroblast growth factor receptor 1
(Homo sapiens (Human))
BDBM50260199
(CHEMBL4066038)
Show SMILES COc1cc(OC)c(Cl)c(N2Cc3cnc(Nc4cc(F)cc(F)c4)nc3N(C3CCN(CC3)C(=O)\C=C\CN(C)C)C2=O)c1Cl
Show InChI InChI=1S/C31H33Cl2F2N7O4/c1-39(2)9-5-6-25(43)40-10-7-22(8-11-40)42-29-18(16-36-30(38-29)37-21-13-19(34)12-20(35)14-21)17-41(31(42)44)28-26(32)23(45-3)15-24(46-4)27(28)33/h5-6,12-16,22H,7-11,17H2,1-4H3,(H,36,37,38)/b6-5+
NCI pathway
Reactome pathway
n/an/a 1.80n/an/an/an/an/an/a
Guangzhou Institutes of Biomedicine and Health
Curated by ChEMBL
Assay Description
Inhibition of human recombinant His-tagged FGFR1 cytoplasmic domain (308 to 731 residues) expressed in baculovirus using Tyr-4 peptide after 1 hr by ...
Eur J Med Chem 135: 531-543 (2017)
Article DOI: 10.1016/j.ejmech.2017.04.049
BindingDB Entry DOI: 10.7270/Q2K076QF