BDBM50260287 CHEMBL494579::cycloaltilisin 7
SMILES: [#6]\[#6](-[#6])=[#6]\[#6]-[#6]C1([#6])[#8]-c2cc(-[#8])c3-[#6](=O)-[#6]-[#6](-[#8]-c3c2-[#6]=[#6]1)-c1ccc(-[#8])cc1
InChI Key: InChIKey=VSBUTPUUSVOZDI-UHFFFAOYSA-N
Data: 1 IC50
Activity Spreadsheet -- Enzyme Inhibition Constant Data from BindingDB
Found 1 hit for monomerid = 50260287
Trg + Lig
Ki
nM
ΔG°
kcal/mole
IC50
nM
Kd
nM
EC50/IC50
nM
koff
s-1
kon
M-1s-1
pHTemp
°C
Cathepsin K
(Homo sapiens (Human))
BDBM50260287
(CHEMBL494579 | cycloaltilisin 7)
Show SMILES [#6]\[#6](-[#6])=[#6]\[#6]-[#6]C1([#6])[#8]-c2cc(-[#8])c3-[#6](=O)-[#6]-[#6](-[#8]-c3c2-[#6]=[#6]1)-c1ccc(-[#8])cc1 |c:23|
Show InChI InChI=1S/C25H26O5/c1-15(2)5-4-11-25(3)12-10-18-22(30-25)14-20(28)23-19(27)13-21(29-24(18)23)16-6-8-17(26)9-7-16/h5-10,12,14,21,26,28H,4,11,13H2,1-3H3
Reactome pathway
n/an/a 840n/an/an/an/an/an/a
Millennium Pharmaceuticals Inc.
Curated by ChEMBL
Assay Description
Inhibition of cathepsin K (unknown origin) by fluorimetric assay
J Nat Prod 65: 624-7 (2002)
BindingDB Entry DOI: 10.7270/Q2FT8KRV