BDBM50260407 CHEMBL521826::N-(2-(5-Methoxycarbonylamino-benzo[b]furan-3-yl)ethyl)isopropylcarboxamide::methyl 3-(2-isobutyramidoethyl)benzofuran-5-ylcarbamate
SMILES: COC(=O)Nc1ccc2occ(CCNC(=O)C(C)C)c2c1
InChI Key: InChIKey=CQWNTRFWWAONMJ-UHFFFAOYSA-N
Data: 3 IC50
Activity Spreadsheet -- Enzyme Inhibition Constant Data from BindingDB
Found 3 hits for monomerid = 50260407
Trg + Lig
Ki
nM
ΔG°
kcal/mole
IC50
nM
Kd
nM
EC50/IC50
nM
koff
s-1
kon
M-1s-1
pHTemp
°C
Melatonin receptor
(Homo sapiens (Human))
BDBM50260407
(CHEMBL521826 | N-(2-(5-Methoxycarbonylamino-benzo[...)
Show SMILES COC(=O)Nc1ccc2occ(CCNC(=O)C(C)C)c2c1
Show InChI InChI=1S/C16H20N2O4/c1-10(2)15(19)17-7-6-11-9-22-14-5-4-12(8-13(11)14)18-16(20)21-3/h4-5,8-10H,6-7H2,1-3H3,(H,17,19)(H,18,20)
Reactome pathway
n/an/a 5.35E+3n/an/an/an/an/an/a
Université de Lille
Curated by ChEMBL
Assay Description
Displacement of 2-[125I]iodomelatonin from human MT1 receptor expressed in HEK293 cells
Bioorg Med Chem 16: 4954-62 (2008)
Article DOI: 10.1016/j.bmc.2008.03.036
BindingDB Entry DOI: 10.7270/Q2JM29DN
Ribosyldihydronicotinamide dehydrogenase [quinone]
(Homo sapiens (Human))
BDBM50260407
(CHEMBL521826 | N-(2-(5-Methoxycarbonylamino-benzo[...)
Show SMILES COC(=O)Nc1ccc2occ(CCNC(=O)C(C)C)c2c1
Show InChI InChI=1S/C16H20N2O4/c1-10(2)15(19)17-7-6-11-9-22-14-5-4-12(8-13(11)14)18-16(20)21-3/h4-5,8-10H,6-7H2,1-3H3,(H,17,19)(H,18,20)
n/an/a 22.9n/an/an/an/an/an/a
Lanzhou University
Curated by ChEMBL
Assay Description
Displacement of [125I]iodomelatonin from MT3/QR2 melatonin binding site expressed in CHO cells
Eur J Med Chem 43: 2861-9 (2008)
Article DOI: 10.1016/j.ejmech.2008.02.012
BindingDB Entry DOI: 10.7270/Q21C1Z31
Melatonin receptor
(Homo sapiens (Human))
BDBM50260407
(CHEMBL521826 | N-(2-(5-Methoxycarbonylamino-benzo[...)
Show SMILES COC(=O)Nc1ccc2occ(CCNC(=O)C(C)C)c2c1
Show InChI InChI=1S/C16H20N2O4/c1-10(2)15(19)17-7-6-11-9-22-14-5-4-12(8-13(11)14)18-16(20)21-3/h4-5,8-10H,6-7H2,1-3H3,(H,17,19)(H,18,20)
Reactome pathway
n/an/a 4.58E+3n/an/an/an/an/an/a
Université de Lille
Curated by ChEMBL
Assay Description
Displacement of 2-[125I]iodomelatonin from human MT2 receptor expressed in HEK293 cells
Bioorg Med Chem 16: 4954-62 (2008)
Article DOI: 10.1016/j.bmc.2008.03.036
BindingDB Entry DOI: 10.7270/Q2JM29DN