BDBM50260470 CHEMBL4063353
SMILES: CN1C=CN(C=C1)C1OC(=CN1c1ccc(cc1)S(N)(=O)=O)C(Cl)(Cl)Cl
InChI Key: InChIKey=IJHBYPXTQCLIIK-UHFFFAOYSA-N
Data: 2 IC50
Activity Spreadsheet -- Enzyme Inhibition Constant Data from BindingDB
Found 2 hits for monomerid = 50260470
Trg + Lig
Ki
nM
ΔG°
kcal/mole
IC50
nM
Kd
nM
EC50/IC50
nM
koff
s-1
kon
M-1s-1
pHTemp
°C
Cyclooxygenase
(RAT)
BDBM50260470
(CHEMBL4063353)
Show SMILES CN1C=CN(C=C1)C1OC(=CN1c1ccc(cc1)S(N)(=O)=O)C(Cl)(Cl)Cl |c:2,5,10|
Show InChI InChI=1S/C15H15Cl3N4O3S/c1-20-6-8-21(9-7-20)14-22(10-13(25-14)15(16,17)18)11-2-4-12(5-3-11)26(19,23)24/h2-10,14H,1H3,(H2,19,23,24)
Reactome pathway
n/an/a 0.0990n/an/an/an/an/an/a
Chongqing Normal University
Curated by ChEMBL
Assay Description
Inhibition of COX-2 in rat peritoneal macrophages assessed as reduction in PGE2 production using radiolabelled-arachidonic acid as substrate pretreat...
Bioorg Med Chem 25: 4887-4893 (2017)
Article DOI: 10.1016/j.bmc.2017.07.038
BindingDB Entry DOI: 10.7270/Q2KW5JGN
Cyclooxygenase
(RAT)
BDBM50260470
(CHEMBL4063353)
Show SMILES CN1C=CN(C=C1)C1OC(=CN1c1ccc(cc1)S(N)(=O)=O)C(Cl)(Cl)Cl |c:2,5,10|
Show InChI InChI=1S/C15H15Cl3N4O3S/c1-20-6-8-21(9-7-20)14-22(10-13(25-14)15(16,17)18)11-2-4-12(5-3-11)26(19,23)24/h2-10,14H,1H3,(H2,19,23,24)
n/an/a 53n/an/an/an/an/an/a
Chongqing Normal University
Curated by ChEMBL
Assay Description
Inhibition of COX-1 in rat peritoneal macrophages assessed as reduction in [125I]-6-Keto-PGF1alpha production using arachidonic acid as substrate pre...
Bioorg Med Chem 25: 4887-4893 (2017)
Article DOI: 10.1016/j.bmc.2017.07.038
BindingDB Entry DOI: 10.7270/Q2KW5JGN