null
SMILES: OC1C(O)C2OC(=O)c3cc(O)c(O)c(O)c3-c3c(O)c(O)c(O)cc3C(=O)CC2O[C@@H]1OC(=O)c1cc(O)c(O)c(O)c1
InChI Key: InChIKey=DPRNKDPFIHTCKE-QVTWFEFESA-N
Activity Spreadsheet -- Enzyme Inhibition Constant Data from BindingDB
Found 1 hit for monomerid = 50260505
Trg + Lig
Ki
nM
ΔG°
kcal/mole
IC50
nM
Kd
nM
EC50/IC50
nM
koff
s-1
kon
M-1s-1
pHTemp
°C
O94806/P05129/P05771/P17252/P24723/P41743/Q02156/Q04759/Q05513/Q05655/Q15139
(Homo sapiens (Human))
BDBM50260505
(CHEMBL82762)
Show SMILES OC1C(O)C2OC(=O)c3cc(O)c(O)c(O)c3-c3c(O)c(O)c(O)cc3C(=O)CC2O[C@@H]1OC(=O)c1cc(O)c(O)c(O)c1
Show InChI InChI=1S/C27H22O17/c28-9-5-14-24(22(38)23(39)27(42-14)44-25(40)6-1-10(29)17(33)11(30)2-6)43-26(41)8-4-13(32)19(35)21(37)16(8)15-7(9)3-12(31)18(34)20(15)36/h1-4,14,22-24,27,29-39H,5H2/t14?,22?,23?,24?,27-/m1/s1
n/an/a 1.50E+4n/an/an/an/an/an/a
TBA
Assay Description
Inhibitory activity against protein kinase C (PKC)
Citation and Details
Article DOI: 10.1016/S0960-894X(01)81072-6
BindingDB Entry DOI: 10.7270/Q2G44T0S