BDBM50260536 Beta-Glucogallin::CHEBI:15834::CHEMBL480283
SMILES: OC[C@H]1O[C@@H](OC(=O)c2cc(O)c(O)c(O)c2)[C@H](O)[C@@H](O)[C@@H]1O
InChI Key: InChIKey=GDVRUDXLQBVIKP-HQHREHCSSA-N
Data: 2 IC50
Activity Spreadsheet -- Enzyme Inhibition Constant Data from BindingDB
Found 2 hits for monomerid = 50260536
Trg + Lig
Ki
nM
ΔG°
kcal/mole
IC50
nM
Kd
nM
EC50/IC50
nM
koff
s-1
kon
M-1s-1
pHTemp
°C
Aldose reductase
(Homo sapiens (Human))
BDBM50260536
(Beta-Glucogallin | CHEBI:15834 | CHEMBL480283)
Show SMILES OC[C@H]1O[C@@H](OC(=O)c2cc(O)c(O)c(O)c2)[C@H](O)[C@@H](O)[C@@H]1O |r|
Show InChI InChI=1S/C13H16O10/c14-3-7-9(18)10(19)11(20)13(22-7)23-12(21)4-1-5(15)8(17)6(16)2-4/h1-2,7,9-11,13-20H,3H2/t7-,9-,10+,11-,13+/m1/s1
n/an/a 8.00E+3n/an/an/an/an/an/a
University of Colorado Anschutz Medical Campus
Curated by ChEMBL
Assay Description
Inhibition of human recombinant AKR1B1 expressed in Escherichia coli using DL-glyceraldehyde as substrate after 5 mins by spectrophotometry
J Med Chem 57: 71-7 (2014)
Article DOI: 10.1021/jm401311d
BindingDB Entry DOI: 10.7270/Q2KW5K0S
Protein kinase C (PKC)
(Homo sapiens (Human))
BDBM50260536
(Beta-Glucogallin | CHEBI:15834 | CHEMBL480283)
Show SMILES OC[C@H]1O[C@@H](OC(=O)c2cc(O)c(O)c(O)c2)[C@H](O)[C@@H](O)[C@@H]1O |r|
Show InChI InChI=1S/C13H16O10/c14-3-7-9(18)10(19)11(20)13(22-7)23-12(21)4-1-5(15)8(17)6(16)2-4/h1-2,7,9-11,13-20H,3H2/t7-,9-,10+,11-,13+/m1/s1
n/an/a>1.00E+5n/an/an/an/an/an/a
TBA
Assay Description
Inhibitory activity against protein kinase C (PKC)
Citation and Details
Article DOI: 10.1016/S0960-894X(01)81072-6
BindingDB Entry DOI: 10.7270/Q2G44T0S