BDBM50260608 CHEMBL4098594
SMILES: Cc1nc2C(O)CCCn2c(=O)c1CCN1CCN(CC1)c1noc2cc(F)ccc12
InChI Key: InChIKey=NAYOORQZOBSVOI-UHFFFAOYSA-N
Data: 2 IC50  1 EC50
Activity Spreadsheet -- Enzyme Inhibition Constant Data from BindingDB
Found 3 hits for monomerid = 50260608
Trg + Lig
Ki
nM
ΔG°
kcal/mole
IC50
nM
Kd
nM
EC50/IC50
nM
koff
s-1
kon
M-1s-1
pHTemp
°C
5-hydroxytryptamine receptor 2A
(Homo sapiens (Human))
BDBM50260608
(CHEMBL4098594)
Show SMILES Cc1nc2C(O)CCCn2c(=O)c1CCN1CCN(CC1)c1noc2cc(F)ccc12
Show InChI InChI=1S/C22H26FN5O3/c1-14-16(22(30)28-7-2-3-18(29)21(28)24-14)6-8-26-9-11-27(12-10-26)20-17-5-4-15(23)13-19(17)31-25-20/h4-5,13,18,29H,2-3,6-12H2,1H3
Reactome pathway
n/an/a 2.90n/an/an/an/an/an/a
Xinjiang Technical Institute of Physics and Chemistry
Curated by ChEMBL
Assay Description
Antagonist activity at 5-HT2A receptor (unknown origin) after 10 mins by calcium 5 dye based FLIPR assay
Bioorg Med Chem 25: 4904-4916 (2017)
Article DOI: 10.1016/j.bmc.2017.07.040
BindingDB Entry DOI: 10.7270/Q2Z3222T
D(2) dopamine receptor
(Homo sapiens (Human))
BDBM50260608
(CHEMBL4098594)
Show SMILES Cc1nc2C(O)CCCn2c(=O)c1CCN1CCN(CC1)c1noc2cc(F)ccc12
Show InChI InChI=1S/C22H26FN5O3/c1-14-16(22(30)28-7-2-3-18(29)21(28)24-14)6-8-26-9-11-27(12-10-26)20-17-5-4-15(23)13-19(17)31-25-20/h4-5,13,18,29H,2-3,6-12H2,1H3
Reactome pathway
n/an/a 9.70n/an/an/an/an/an/a
Xinjiang Technical Institute of Physics and Chemistry
Curated by ChEMBL
Assay Description
Antagonist activity at dopamine D2 receptor (unknown origin) after 60 mins by Ultra lance cAMP assay
Bioorg Med Chem 25: 4904-4916 (2017)
Article DOI: 10.1016/j.bmc.2017.07.040
BindingDB Entry DOI: 10.7270/Q2Z3222T
5-hydroxytryptamine receptor 1A
(Homo sapiens (Human))
BDBM50260608
(CHEMBL4098594)
Show SMILES Cc1nc2C(O)CCCn2c(=O)c1CCN1CCN(CC1)c1noc2cc(F)ccc12
Show InChI InChI=1S/C22H26FN5O3/c1-14-16(22(30)28-7-2-3-18(29)21(28)24-14)6-8-26-9-11-27(12-10-26)20-17-5-4-15(23)13-19(17)31-25-20/h4-5,13,18,29H,2-3,6-12H2,1H3
n/an/an/an/a>1.00E+4n/an/an/an/a
Xinjiang Technical Institute of Physics and Chemistry
Curated by ChEMBL
Assay Description
Agonist activity at 5-HT1A receptor (unknown origin) after 60 mins by Ultra lance cAMP assay
Bioorg Med Chem 25: 4904-4916 (2017)
Article DOI: 10.1016/j.bmc.2017.07.040
BindingDB Entry DOI: 10.7270/Q2Z3222T