BDBM50260705 3-(3-chlorophenyl)-5-(1-(4-chlorophenyl)cyclobutyl)-4-methyl-4H-1,2,4-triazole::CHEMBL497951
SMILES: Cn1c(nnc1C1(CCC1)c1ccc(Cl)cc1)-c1cccc(Cl)c1
InChI Key: InChIKey=NQHSJELQQVWZJD-UHFFFAOYSA-N
Data: 4 IC50
Activity Spreadsheet -- Enzyme Inhibition Constant Data from BindingDB
Found 4 hits for monomerid = 50260705
Trg + Lig
Ki
nM
ΔG°
kcal/mole
IC50
nM
Kd
nM
EC50/IC50
nM
koff
s-1
kon
M-1s-1
pHTemp
°C
11-beta-hydroxysteroid dehydrogenase 1
(Homo sapiens (Human))
BDBM50260705
(3-(3-chlorophenyl)-5-(1-(4-chlorophenyl)cyclobutyl...)
Show SMILES Cn1c(nnc1C1(CCC1)c1ccc(Cl)cc1)-c1cccc(Cl)c1
Show InChI InChI=1S/C19H17Cl2N3/c1-24-17(13-4-2-5-16(21)12-13)22-23-18(24)19(10-3-11-19)14-6-8-15(20)9-7-14/h2,4-9,12H,3,10-11H2,1H3
Reactome pathway
n/an/a 1n/an/an/an/an/an/a
Merck Research Laboratories
Curated by ChEMBL
Assay Description
Inhibition of human 11beta HSD1 by SPA assay
Bioorg Med Chem Lett 18: 3405-11 (2008)
Article DOI: 10.1016/j.bmcl.2008.04.013
BindingDB Entry DOI: 10.7270/Q2XP74QM
11-beta-Hydroxysteroid Dehydrogenase 2 (11-beta-HSD2)
(Mus musculus (mouse))
BDBM50260705
(3-(3-chlorophenyl)-5-(1-(4-chlorophenyl)cyclobutyl...)
Show SMILES Cn1c(nnc1C1(CCC1)c1ccc(Cl)cc1)-c1cccc(Cl)c1
Show InChI InChI=1S/C19H17Cl2N3/c1-24-17(13-4-2-5-16(21)12-13)22-23-18(24)19(10-3-11-19)14-6-8-15(20)9-7-14/h2,4-9,12H,3,10-11H2,1H3
n/an/a>4.00E+3n/an/an/an/an/an/a
Merck Research Laboratories
Curated by ChEMBL
Assay Description
Inhibition of mouse 11beta HSD2
Bioorg Med Chem Lett 18: 3405-11 (2008)
Article DOI: 10.1016/j.bmcl.2008.04.013
BindingDB Entry DOI: 10.7270/Q2XP74QM
11-beta-hydroxysteroid dehydrogenase 2
(Homo sapiens (Human))
BDBM50260705
(3-(3-chlorophenyl)-5-(1-(4-chlorophenyl)cyclobutyl...)
Show SMILES Cn1c(nnc1C1(CCC1)c1ccc(Cl)cc1)-c1cccc(Cl)c1
Show InChI InChI=1S/C19H17Cl2N3/c1-24-17(13-4-2-5-16(21)12-13)22-23-18(24)19(10-3-11-19)14-6-8-15(20)9-7-14/h2,4-9,12H,3,10-11H2,1H3
n/an/a>4.00E+3n/an/an/an/an/an/a
Merck Research Laboratories
Curated by ChEMBL
Assay Description
Inhibition of human 11beta HSD2
Bioorg Med Chem Lett 18: 3405-11 (2008)
Article DOI: 10.1016/j.bmcl.2008.04.013
BindingDB Entry DOI: 10.7270/Q2XP74QM
11-beta-hydroxysteroid dehydrogenase 1
(Mus musculus (mouse))
BDBM50260705
(3-(3-chlorophenyl)-5-(1-(4-chlorophenyl)cyclobutyl...)
Show SMILES Cn1c(nnc1C1(CCC1)c1ccc(Cl)cc1)-c1cccc(Cl)c1
Show InChI InChI=1S/C19H17Cl2N3/c1-24-17(13-4-2-5-16(21)12-13)22-23-18(24)19(10-3-11-19)14-6-8-15(20)9-7-14/h2,4-9,12H,3,10-11H2,1H3
Reactome pathway
n/an/a 34n/an/an/an/an/an/a
Merck Research Laboratories
Curated by ChEMBL
Assay Description
Inhibition of mouse 11beta HSD1 by SPA assay
Bioorg Med Chem Lett 18: 3405-11 (2008)
Article DOI: 10.1016/j.bmcl.2008.04.013
BindingDB Entry DOI: 10.7270/Q2XP74QM