null
SMILES: Fc1cc(NCCC2CCOCC2)c(Cl)cc1S(=O)(=O)Nc1nccs1
InChI Key: InChIKey=WPCMGHHEOJLHRM-UHFFFAOYSA-N
Activity Spreadsheet -- Enzyme Inhibition Constant Data from BindingDB
Found 5 hits for monomerid = 50261129
Trg + Lig
Ki
nM
ΔG°
kcal/mole
IC50
nM
Kd
nM
EC50/IC50
nM
koff
s-1
kon
M-1s-1
pHTemp
°C
Cytochrome P450 3A4
(Homo sapiens (Human))
BDBM50261129
(CHEMBL4064762 | US10836758, Example 71)
Show SMILES Fc1cc(NCCC2CCOCC2)c(Cl)cc1S(=O)(=O)Nc1nccs1
Show InChI InChI=1S/C16H19ClFN3O3S2/c17-12-9-15(26(22,23)21-16-20-5-8-25-16)13(18)10-14(12)19-4-1-11-2-6-24-7-3-11/h5,8-11,19H,1-4,6-7H2,(H,20,21)
Reactome pathway
n/an/a>2.00E+4n/an/an/an/an/an/a
Bristol-Myers Squibb Research and Development, 5 Research Parkway, Wallingford, CT 06492-7660, USA. Electronic address: yong-jin.wu@bms.com.
Curated by ChEMBL
Assay Description
Inhibition of human recombinant CYP3A4 expressed in baculovirus-infected insect cells using 7-Benzoyloxy-4-trifluoromethyl coumarin substrate in pres...
Bioorg Med Chem 25: 5490-5505 (2017)
Article DOI: 10.1016/j.bmc.2017.08.012
BindingDB Entry DOI: 10.7270/Q20V8G8N
Cytochrome P450 2C9
(Homo sapiens (Human))
BDBM50261129
(CHEMBL4064762 | US10836758, Example 71)
Show SMILES Fc1cc(NCCC2CCOCC2)c(Cl)cc1S(=O)(=O)Nc1nccs1
Show InChI InChI=1S/C16H19ClFN3O3S2/c17-12-9-15(26(22,23)21-16-20-5-8-25-16)13(18)10-14(12)19-4-1-11-2-6-24-7-3-11/h5,8-11,19H,1-4,6-7H2,(H,20,21)
Reactome pathway
n/an/a>2.00E+4n/an/an/an/an/an/a
Bristol-Myers Squibb Research and Development, 5 Research Parkway, Wallingford, CT 06492-7660, USA. Electronic address: yong-jin.wu@bms.com.
Curated by ChEMBL
Assay Description
Inhibition of human CYP2C9
Bioorg Med Chem 25: 5490-5505 (2017)
Article DOI: 10.1016/j.bmc.2017.08.012
BindingDB Entry DOI: 10.7270/Q20V8G8N
Sodium channel protein type 9 subunit alpha
(Homo sapiens (Human))
BDBM50261129
(CHEMBL4064762 | US10836758, Example 71)
Show SMILES Fc1cc(NCCC2CCOCC2)c(Cl)cc1S(=O)(=O)Nc1nccs1
Show InChI InChI=1S/C16H19ClFN3O3S2/c17-12-9-15(26(22,23)21-16-20-5-8-25-16)13(18)10-14(12)19-4-1-11-2-6-24-7-3-11/h5,8-11,19H,1-4,6-7H2,(H,20,21)
US Patent
n/an/a 120n/an/an/an/an/an/a
BRISTOL-MYERS SQUIBB COMPANY
US Patent
Assay Description
hNaV1.7 binding affinities were determined with a filtration binding assay using purified membranes from HEK293 cells stably expressing hNaV1.7. HEK2...
US Patent US10836758 (2020)
Sodium channel protein type 5 subunit alpha
(Homo sapiens (Human))
BDBM50261129
(CHEMBL4064762 | US10836758, Example 71)
Show SMILES Fc1cc(NCCC2CCOCC2)c(Cl)cc1S(=O)(=O)Nc1nccs1
Show InChI InChI=1S/C16H19ClFN3O3S2/c17-12-9-15(26(22,23)21-16-20-5-8-25-16)13(18)10-14(12)19-4-1-11-2-6-24-7-3-11/h5,8-11,19H,1-4,6-7H2,(H,20,21)
n/an/a 2.40E+3n/an/an/an/an/an/a
Bristol-Myers Squibb Research and Development, 5 Research Parkway, Wallingford, CT 06492-7660, USA. Electronic address: yong-jin.wu@bms.com.
Curated by ChEMBL
Assay Description
Inhibition of human Nav1.5 inactivated state form expressed in HEK293 cells at -50 mV holding potential by by automated patch clamp electrophysiology...
Bioorg Med Chem 25: 5490-5505 (2017)
Article DOI: 10.1016/j.bmc.2017.08.012
BindingDB Entry DOI: 10.7270/Q20V8G8N
Sodium channel protein type 5 subunit alpha
(Homo sapiens (Human))
BDBM50261129
(CHEMBL4064762 | US10836758, Example 71)
Show SMILES Fc1cc(NCCC2CCOCC2)c(Cl)cc1S(=O)(=O)Nc1nccs1
Show InChI InChI=1S/C16H19ClFN3O3S2/c17-12-9-15(26(22,23)21-16-20-5-8-25-16)13(18)10-14(12)19-4-1-11-2-6-24-7-3-11/h5,8-11,19H,1-4,6-7H2,(H,20,21)
n/an/a 120n/an/an/an/an/an/a
Bristol-Myers Squibb Research and Development, 5 Research Parkway, Wallingford, CT 06492-7660, USA. Electronic address: yong-jin.wu@bms.com.
Curated by ChEMBL
Assay Description
Inhibition of human Nav1.5 inactivated state form expressed in HEK293 cells at -60 mV holding potential by by automated patch clamp electrophysiology...
Bioorg Med Chem 25: 5490-5505 (2017)
Article DOI: 10.1016/j.bmc.2017.08.012
BindingDB Entry DOI: 10.7270/Q20V8G8N