BDBM50261261 CHEMBL4075453
SMILES: Clc1cccc(Cl)c1-c1nc2ccnc(Nc3cc(ncn3)N3CCCC3)c2[nH]1
InChI Key: InChIKey=HBHKVPAWYUUWKL-UHFFFAOYSA-N
Data: 2 KI  2 EC50
Activity Spreadsheet -- Enzyme Inhibition Constant Data from BindingDB
Found 4 hits for monomerid = 50261261
Trg + Lig
Ki
nM
ΔG°
kcal/mole
IC50
nM
Kd
nM
EC50/IC50
nM
koff
s-1
kon
M-1s-1
pHTemp
°C
Non-receptor tyrosine-protein kinase TYK2
(Homo sapiens (Human))
BDBM50261261
(CHEMBL4075453)
Show SMILES Clc1cccc(Cl)c1-c1nc2ccnc(Nc3cc(ncn3)N3CCCC3)c2[nH]1
Show InChI InChI=1S/C20H17Cl2N7/c21-12-4-3-5-13(22)17(12)19-26-14-6-7-23-20(18(14)28-19)27-15-10-16(25-11-24-15)29-8-1-2-9-29/h3-7,10-11H,1-2,8-9H2,(H,26,28)(H,23,24,25,27)
0.5n/an/an/an/an/an/an/an/a
Genentech
Curated by ChEMBL
Assay Description
Inhibition of TYK2 (unknown origin) by biochemical assay
Bioorg Med Chem Lett 27: 4370-4376 (2017)
Article DOI: 10.1016/j.bmcl.2017.08.022
BindingDB Entry DOI: 10.7270/Q2RF5XG8
Tyrosine-protein kinase JAK2
(Homo sapiens (Human))
BDBM50261261
(CHEMBL4075453)
Show SMILES Clc1cccc(Cl)c1-c1nc2ccnc(Nc3cc(ncn3)N3CCCC3)c2[nH]1
Show InChI InChI=1S/C20H17Cl2N7/c21-12-4-3-5-13(22)17(12)19-26-14-6-7-23-20(18(14)28-19)27-15-10-16(25-11-24-15)29-8-1-2-9-29/h3-7,10-11H,1-2,8-9H2,(H,26,28)(H,23,24,25,27)
Reactome pathway
16n/an/an/an/an/an/an/an/a
Genentech
Curated by ChEMBL
Assay Description
Inhibition of JAK2 (unknown origin) by biochemical assay
Bioorg Med Chem Lett 27: 4370-4376 (2017)
Article DOI: 10.1016/j.bmcl.2017.08.022
BindingDB Entry DOI: 10.7270/Q2RF5XG8
Tyrosine-protein kinase JAK2
(Homo sapiens (Human))
BDBM50261261
(CHEMBL4075453)
Show SMILES Clc1cccc(Cl)c1-c1nc2ccnc(Nc3cc(ncn3)N3CCCC3)c2[nH]1
Show InChI InChI=1S/C20H17Cl2N7/c21-12-4-3-5-13(22)17(12)19-26-14-6-7-23-20(18(14)28-19)27-15-10-16(25-11-24-15)29-8-1-2-9-29/h3-7,10-11H,1-2,8-9H2,(H,26,28)(H,23,24,25,27)
Reactome pathway
n/an/an/an/a 1.00E+3n/an/an/an/a
Genentech
Curated by ChEMBL
Assay Description
Inhibition of JAK2 (unknown origin) assessed as reduction in EPO-mediated STAT5 phosphorylation by cell based readout assay
Bioorg Med Chem Lett 27: 4370-4376 (2017)
Article DOI: 10.1016/j.bmcl.2017.08.022
BindingDB Entry DOI: 10.7270/Q2RF5XG8
Non-receptor tyrosine-protein kinase TYK2
(Homo sapiens (Human))
BDBM50261261
(CHEMBL4075453)
Show SMILES Clc1cccc(Cl)c1-c1nc2ccnc(Nc3cc(ncn3)N3CCCC3)c2[nH]1
Show InChI InChI=1S/C20H17Cl2N7/c21-12-4-3-5-13(22)17(12)19-26-14-6-7-23-20(18(14)28-19)27-15-10-16(25-11-24-15)29-8-1-2-9-29/h3-7,10-11H,1-2,8-9H2,(H,26,28)(H,23,24,25,27)
n/an/an/an/a 520n/an/an/an/a
Genentech
Curated by ChEMBL
Assay Description
Inhibition of TYK2 (unknown origin) assessed as reduction in IL-23 induced STAT3 phosphorylation by cell based ELISA
Bioorg Med Chem Lett 27: 4370-4376 (2017)
Article DOI: 10.1016/j.bmcl.2017.08.022
BindingDB Entry DOI: 10.7270/Q2RF5XG8