BDBM50261272 CHEMBL4105148
SMILES: Cc1nccc(Nc2nccc3nc([nH]c23)-c2c(Cl)cccc2Cl)n1
InChI Key: InChIKey=DHBYBIHVLGMSSY-UHFFFAOYSA-N
Data: 2 KI  2 EC50
Activity Spreadsheet -- Enzyme Inhibition Constant Data from BindingDB
Found 4 hits for monomerid = 50261272
Trg + Lig
Ki
nM
ΔG°
kcal/mole
IC50
nM
Kd
nM
EC50/IC50
nM
koff
s-1
kon
M-1s-1
pHTemp
°C
Non-receptor tyrosine-protein kinase TYK2
(Homo sapiens (Human))
BDBM50261272
(CHEMBL4105148)
Show SMILES Cc1nccc(Nc2nccc3nc([nH]c23)-c2c(Cl)cccc2Cl)n1
Show InChI InChI=1S/C17H12Cl2N6/c1-9-20-8-6-13(22-9)24-17-15-12(5-7-21-17)23-16(25-15)14-10(18)3-2-4-11(14)19/h2-8H,1H3,(H,23,25)(H,20,21,22,24)
5.10n/an/an/an/an/an/an/an/a
Genentech
Curated by ChEMBL
Assay Description
Inhibition of TYK2 (unknown origin) by biochemical assay
Bioorg Med Chem Lett 27: 4370-4376 (2017)
Article DOI: 10.1016/j.bmcl.2017.08.022
BindingDB Entry DOI: 10.7270/Q2RF5XG8
Tyrosine-protein kinase JAK2
(Homo sapiens (Human))
BDBM50261272
(CHEMBL4105148)
Show SMILES Cc1nccc(Nc2nccc3nc([nH]c23)-c2c(Cl)cccc2Cl)n1
Show InChI InChI=1S/C17H12Cl2N6/c1-9-20-8-6-13(22-9)24-17-15-12(5-7-21-17)23-16(25-15)14-10(18)3-2-4-11(14)19/h2-8H,1H3,(H,23,25)(H,20,21,22,24)
Reactome pathway
440n/an/an/an/an/an/an/an/a
Genentech
Curated by ChEMBL
Assay Description
Inhibition of JAK2 (unknown origin) by biochemical assay
Bioorg Med Chem Lett 27: 4370-4376 (2017)
Article DOI: 10.1016/j.bmcl.2017.08.022
BindingDB Entry DOI: 10.7270/Q2RF5XG8
Non-receptor tyrosine-protein kinase TYK2
(Homo sapiens (Human))
BDBM50261272
(CHEMBL4105148)
Show SMILES Cc1nccc(Nc2nccc3nc([nH]c23)-c2c(Cl)cccc2Cl)n1
Show InChI InChI=1S/C17H12Cl2N6/c1-9-20-8-6-13(22-9)24-17-15-12(5-7-21-17)23-16(25-15)14-10(18)3-2-4-11(14)19/h2-8H,1H3,(H,23,25)(H,20,21,22,24)
n/an/an/an/a 9.40E+3n/an/an/an/a
Genentech
Curated by ChEMBL
Assay Description
Inhibition of TYK2 (unknown origin) assessed as reduction in IL-23 induced STAT3 phosphorylation by cell based ELISA
Bioorg Med Chem Lett 27: 4370-4376 (2017)
Article DOI: 10.1016/j.bmcl.2017.08.022
BindingDB Entry DOI: 10.7270/Q2RF5XG8
Tyrosine-protein kinase JAK2
(Homo sapiens (Human))
BDBM50261272
(CHEMBL4105148)
Show SMILES Cc1nccc(Nc2nccc3nc([nH]c23)-c2c(Cl)cccc2Cl)n1
Show InChI InChI=1S/C17H12Cl2N6/c1-9-20-8-6-13(22-9)24-17-15-12(5-7-21-17)23-16(25-15)14-10(18)3-2-4-11(14)19/h2-8H,1H3,(H,23,25)(H,20,21,22,24)
Reactome pathway
n/an/an/an/a 1.00E+4n/an/an/an/a
Genentech
Curated by ChEMBL
Assay Description
Inhibition of JAK2 (unknown origin) assessed as reduction in EPO-mediated STAT5 phosphorylation by cell based readout assay
Bioorg Med Chem Lett 27: 4370-4376 (2017)
Article DOI: 10.1016/j.bmcl.2017.08.022
BindingDB Entry DOI: 10.7270/Q2RF5XG8