BDBM50261645 4-(3-Amino-2-oxo-1,2-dihydroquinoxalin-5-yloxy)-6-(4-(trifluoromethyl)phenyl)pyrimidin-2-aminium trifluoroacetate::CHEMBL469234
SMILES: Nc1nc(Oc2cccc3[nH]c(=O)c(N)nc23)cc(n1)-c1ccc(cc1)C(F)(F)F
InChI Key: InChIKey=MJDPUEVCRFEQCV-UHFFFAOYSA-N
Data: 2 IC50
Activity Spreadsheet -- Enzyme Inhibition Constant Data from BindingDB
Found 2 hits for monomerid = 50261645
Trg + Lig
Ki
nM
ΔG°
kcal/mole
IC50
nM
Kd
nM
EC50/IC50
nM
koff
s-1
kon
M-1s-1
pHTemp
°C
Vanilloid receptor
(Rattus norvegicus (rat))
BDBM50261645
(4-(3-Amino-2-oxo-1,2-dihydroquinoxalin-5-yloxy)-6-...)
Show SMILES Nc1nc(Oc2cccc3[nH]c(=O)c(N)nc23)cc(n1)-c1ccc(cc1)C(F)(F)F
Show InChI InChI=1S/C19H13F3N6O2/c20-19(21,22)10-6-4-9(5-7-10)12-8-14(27-18(24)26-12)30-13-3-1-2-11-15(13)28-16(23)17(29)25-11/h1-8H,(H2,23,28)(H,25,29)(H2,24,26,27)
Reactome pathway
n/an/a 3.70n/an/an/an/an/an/a
Amgen, Inc.
Curated by ChEMBL
Assay Description
Antagonist activity at rat TRPV1 expressed in CHO cells assessed as inhibition of capsaicin-induced calcium influx
J Med Chem 51: 2744-57 (2008)
Article DOI: 10.1021/jm7014638
BindingDB Entry DOI: 10.7270/Q2930SZH
Vanilloid receptor
(Rattus norvegicus (rat))
BDBM50261645
(4-(3-Amino-2-oxo-1,2-dihydroquinoxalin-5-yloxy)-6-...)
Show SMILES Nc1nc(Oc2cccc3[nH]c(=O)c(N)nc23)cc(n1)-c1ccc(cc1)C(F)(F)F
Show InChI InChI=1S/C19H13F3N6O2/c20-19(21,22)10-6-4-9(5-7-10)12-8-14(27-18(24)26-12)30-13-3-1-2-11-15(13)28-16(23)17(29)25-11/h1-8H,(H2,23,28)(H,25,29)(H2,24,26,27)
Reactome pathway
n/an/a 2.60n/an/an/an/a5.0n/a
Amgen, Inc.
Curated by ChEMBL
Assay Description
Antagonist activity at rat TRPV1 expressed in CHO cells assessed as inhibition of pH 5 acid-induced calcium influx
J Med Chem 51: 2744-57 (2008)
Article DOI: 10.1021/jm7014638
BindingDB Entry DOI: 10.7270/Q2930SZH