null
SMILES: Cc1oc(nc1COc1ccc(C[C@H]2CO[C@](C)(OC2)C(O)=O)cc1)-c1ccccc1
InChI Key: InChIKey=PDHHMAZLDSSIHQ-OWWJJEGGSA-N
Activity Spreadsheet -- Enzyme Inhibition Constant Data from BindingDB
Found 2 hits for monomerid = 50261701
Trg + Lig
Ki
nM
ΔG°
kcal/mole
IC50
nM
Kd
nM
EC50/IC50
nM
koff
s-1
kon
M-1s-1
pHTemp
°C
Peroxisome proliferator-activated receptor gamma
(Homo sapiens (Human))
BDBM50261701
(2-Methyl-c-5-[4-(5-methyl-2-phenyloxazol-4-ylmetho...)
Show SMILES Cc1oc(nc1COc1ccc(C[C@H]2CO[C@](C)(OC2)C(O)=O)cc1)-c1ccccc1 |r,wU:13.13,16.21,wD:16.17,(-1.08,-34.97,;-2.35,-34.1,;-3.8,-34.62,;-4.75,-33.41,;-3.88,-32.13,;-2.4,-32.56,;-1.05,-31.82,;.27,-32.62,;1.62,-31.89,;2.93,-32.69,;4.28,-31.96,;4.32,-30.42,;5.67,-29.68,;6.99,-30.48,;8.33,-29.73,;9.65,-30.54,;9.61,-32.08,;11.08,-31.68,;8.25,-32.81,;6.94,-32.01,;10.05,-33.56,;11.54,-33.91,;8.99,-34.67,;3,-29.61,;1.65,-30.35,;-6.29,-33.46,;-7.09,-32.14,;-8.63,-32.19,;-9.36,-33.55,;-8.54,-34.86,;-7,-34.81,)|
Show InChI InChI=1S/C24H25NO6/c1-16-21(25-22(31-16)19-6-4-3-5-7-19)15-28-20-10-8-17(9-11-20)12-18-13-29-24(2,23(26)27)30-14-18/h3-11,18H,12-15H2,1-2H3,(H,26,27)/t18-,24+
NCI pathway
Reactome pathway
n/an/an/an/a 96n/an/an/an/a
Zydus Research Centre
Curated by ChEMBL
Assay Description
Agonist activity at PPARgamma (unknown origin) expressed in human HepG2 cells assessed as induction of receptor transactivation by reporter gene assa...
Bioorg Med Chem 16: 7117-27 (2008)
Article DOI: 10.1016/j.bmc.2008.06.050
BindingDB Entry DOI: 10.7270/Q2K93792
Peroxisome proliferator-activated receptor alpha
(Homo sapiens (Human))
BDBM50261701
(2-Methyl-c-5-[4-(5-methyl-2-phenyloxazol-4-ylmetho...)
Show SMILES Cc1oc(nc1COc1ccc(C[C@H]2CO[C@](C)(OC2)C(O)=O)cc1)-c1ccccc1 |r,wU:13.13,16.21,wD:16.17,(-1.08,-34.97,;-2.35,-34.1,;-3.8,-34.62,;-4.75,-33.41,;-3.88,-32.13,;-2.4,-32.56,;-1.05,-31.82,;.27,-32.62,;1.62,-31.89,;2.93,-32.69,;4.28,-31.96,;4.32,-30.42,;5.67,-29.68,;6.99,-30.48,;8.33,-29.73,;9.65,-30.54,;9.61,-32.08,;11.08,-31.68,;8.25,-32.81,;6.94,-32.01,;10.05,-33.56,;11.54,-33.91,;8.99,-34.67,;3,-29.61,;1.65,-30.35,;-6.29,-33.46,;-7.09,-32.14,;-8.63,-32.19,;-9.36,-33.55,;-8.54,-34.86,;-7,-34.81,)|
Show InChI InChI=1S/C24H25NO6/c1-16-21(25-22(31-16)19-6-4-3-5-7-19)15-28-20-10-8-17(9-11-20)12-18-13-29-24(2,23(26)27)30-14-18/h3-11,18H,12-15H2,1-2H3,(H,26,27)/t18-,24+
n/an/an/an/a 1.09n/an/an/an/a
Zydus Research Centre
Curated by ChEMBL
Assay Description
Agonist activity at PPARalpha (unknown origin) expressed in human HepG2 cells assessed as induction of receptor transactivation by reporter gene assa...
Bioorg Med Chem 16: 7117-27 (2008)
Article DOI: 10.1016/j.bmc.2008.06.050
BindingDB Entry DOI: 10.7270/Q2K93792