BDBM50261732 (2S,3S)-N-(((S)-6-methoxy-1-methyl-1-(trifluoromethyl)-3,4-dihydro-1H-isochromen-7-yl)methyl)-2-phenylpiperidin-3-amine::CHEMBL468350
SMILES: COc1cc2CCO[C@@](C)(c2cc1CN[C@H]1CCCN[C@H]1c1ccccc1)C(F)(F)F
InChI Key: InChIKey=ODEBBNRINYMIRX-PMVMPFDFSA-N
Data: 1 IC50
Activity Spreadsheet -- Enzyme Inhibition Constant Data from BindingDB
Found 1 hit for monomerid = 50261732
Trg + Lig
Ki
nM
ΔG°
kcal/mole
IC50
nM
Kd
nM
EC50/IC50
nM
koff
s-1
kon
M-1s-1
pHTemp
°C
Substance-P receptor
(Homo sapiens (Human))
BDBM50261732
((2S,3S)-N-(((S)-6-methoxy-1-methyl-1-(trifluoromet...)
Show SMILES COc1cc2CCO[C@@](C)(c2cc1CN[C@H]1CCCN[C@H]1c1ccccc1)C(F)(F)F |r|
Show InChI InChI=1S/C24H29F3N2O2/c1-23(24(25,26)27)19-13-18(21(30-2)14-17(19)10-12-31-23)15-29-20-9-6-11-28-22(20)16-7-4-3-5-8-16/h3-5,7-8,13-14,20,22,28-29H,6,9-12,15H2,1-2H3/t20-,22-,23-/m0/s1
Reactome pathway
n/an/a 0.340n/an/an/an/an/an/a
Pfizer Global Research & Development
Curated by ChEMBL
Assay Description
Displacement of [3H]spiperone from NK1 receptor in human IM9 cells
Bioorg Med Chem 16: 7193-205 (2008)
Article DOI: 10.1016/j.bmc.2008.06.047
BindingDB Entry DOI: 10.7270/Q2RV0NHN