BDBM50261797 3-(4-(3-(3-chloropyridin-4-yl)-1,2,4-oxadiazol-5-yl)piperidin-1-yl)quinoline::CHEMBL512108
SMILES: Clc1cnccc1-c1noc(n1)C1CCN(CC1)c1cnc2ccccc2c1
InChI Key: InChIKey=NDFFJTYPUYJISE-UHFFFAOYSA-N
Data: 2 EC50
Activity Spreadsheet -- Enzyme Inhibition Constant Data from BindingDB
Found 2 hits for monomerid = 50261797
Trg + Lig
Ki
nM
ΔG°
kcal/mole
IC50
nM
Kd
nM
EC50/IC50
nM
koff
s-1
kon
M-1s-1
pHTemp
°C
Cannabinoid receptor 2
(Homo sapiens (Human))
BDBM50261797
(3-(4-(3-(3-chloropyridin-4-yl)-1,2,4-oxadiazol-5-y...)
Show SMILES Clc1cnccc1-c1noc(n1)C1CCN(CC1)c1cnc2ccccc2c1
Show InChI InChI=1S/C21H18ClN5O/c22-18-13-23-8-5-17(18)20-25-21(28-26-20)14-6-9-27(10-7-14)16-11-15-3-1-2-4-19(15)24-12-16/h1-5,8,11-14H,6-7,9-10H2
Reactome pathway
n/an/an/an/a 24n/an/an/an/a
Amgen Inc.
Curated by ChEMBL
Assay Description
Agonist activity at human CB2 receptor expressed in insect Sf9 cells assessed as effect on Eu-GTP binding
Bioorg Med Chem Lett 18: 4267-74 (2008)
Article DOI: 10.1016/j.bmcl.2008.06.096
BindingDB Entry DOI: 10.7270/Q21C1WQ8
Cannabinoid receptor 1
(Homo sapiens (Human))
BDBM50261797
(3-(4-(3-(3-chloropyridin-4-yl)-1,2,4-oxadiazol-5-y...)
Show SMILES Clc1cnccc1-c1noc(n1)C1CCN(CC1)c1cnc2ccccc2c1
Show InChI InChI=1S/C21H18ClN5O/c22-18-13-23-8-5-17(18)20-25-21(28-26-20)14-6-9-27(10-7-14)16-11-15-3-1-2-4-19(15)24-12-16/h1-5,8,11-14H,6-7,9-10H2
NCI pathway
Reactome pathway
n/an/an/an/a 96n/an/an/an/a
Amgen Inc.
Curated by ChEMBL
Assay Description
Agonist activity at human CB1 receptor expressed in insect Sf9 cells assessed as effect on Eu-GTP binding
Bioorg Med Chem Lett 18: 4267-74 (2008)
Article DOI: 10.1016/j.bmcl.2008.06.096
BindingDB Entry DOI: 10.7270/Q21C1WQ8