BDBM50261899 9-(2-Hydroxy-4,4-dimethyl-6-oxocyclohexyl)-3,3,6-trimethyl-2,3,4,9-tetrahydro-1H-xanthen-1-one::CHEMBL469256
SMILES: Cc1ccc2C(C3C(=O)CC(C)(C)CC3=O)C3=C(CC(C)(C)CC3=O)Oc2c1
InChI Key: InChIKey=SHEGQUOTWFFURT-UHFFFAOYSA-N
Data: 1 KI  1 IC50
Activity Spreadsheet -- Enzyme Inhibition Constant Data from BindingDB
Found 2 hits for monomerid = 50261899
Trg + Lig
Ki
nM
ΔG°
kcal/mole
IC50
nM
Kd
nM
EC50/IC50
nM
koff
s-1
kon
M-1s-1
pHTemp
°C
Neuropeptide Y receptor type 5 ( NPY Y5)
(Homo sapiens (Human))
BDBM50261899
(9-(2-Hydroxy-4,4-dimethyl-6-oxocyclohexyl)-3,3,6-t...)
Show SMILES Cc1ccc2C(C3C(=O)CC(C)(C)CC3=O)C3=C(CC(C)(C)CC3=O)Oc2c1 |t:17|
Show InChI InChI=1S/C24H28O4/c1-13-6-7-14-18(8-13)28-19-12-24(4,5)11-17(27)22(19)20(14)21-15(25)9-23(2,3)10-16(21)26/h6-8,20-21H,9-12H2,1-5H3
36n/an/an/an/an/an/an/an/a
Tsukuba Research Institute
Curated by ChEMBL
Assay Description
Displacement of [125I]PYY from human recombinant neuropeptide Y5 receptor expressed in thymidine kinase deficient human LM cells
J Med Chem 51: 4765-70 (2008)
Article DOI: 10.1021/jm8003587
BindingDB Entry DOI: 10.7270/Q2J96664
Neuropeptide Y receptor type 5 ( NPY Y5)
(Homo sapiens (Human))
BDBM50261899
(9-(2-Hydroxy-4,4-dimethyl-6-oxocyclohexyl)-3,3,6-t...)
Show SMILES Cc1ccc2C(C3C(=O)CC(C)(C)CC3=O)C3=C(CC(C)(C)CC3=O)Oc2c1 |t:17|
Show InChI InChI=1S/C24H28O4/c1-13-6-7-14-18(8-13)28-19-12-24(4,5)11-17(27)22(19)20(14)21-15(25)9-23(2,3)10-16(21)26/h6-8,20-21H,9-12H2,1-5H3
n/an/a 111n/an/an/an/an/an/a
Tsukuba Research Institute
Curated by ChEMBL
Assay Description
Antagonist activity at human recombinant neuropeptide Y5 receptor expressed in CHO cells coexpressing Gqi5 assessed as inhibition of neuropeptide Y-i...
J Med Chem 51: 4765-70 (2008)
Article DOI: 10.1021/jm8003587
BindingDB Entry DOI: 10.7270/Q2J96664