BDBM50261941 1-(3-(6-Chloropyridin-2-yl)-1,2,4-oxadiazol-5-yl)-7-phenylheptan-1-one::CHEMBL513358
SMILES: Clc1cccc(n1)-c1noc(n1)C(=O)CCCCCCc1ccccc1
InChI Key: InChIKey=VFBPWJFGFCUANY-UHFFFAOYSA-N
Data: 1 KI  1 IC50
Activity Spreadsheet -- Enzyme Inhibition Constant Data from BindingDB
Found 2 hits for monomerid = 50261941
Trg + Lig
Ki
nM
ΔG°
kcal/mole
IC50
nM
Kd
nM
EC50/IC50
nM
koff
s-1
kon
M-1s-1
pHTemp
°C
Fatty-acid amide hydrolase 1 (aa 30-579)
(Rattus norvegicus (rat))
BDBM50261941
(1-(3-(6-Chloropyridin-2-yl)-1,2,4-oxadiazol-5-yl)-...)
Show SMILES Clc1cccc(n1)-c1noc(n1)C(=O)CCCCCCc1ccccc1
Show InChI InChI=1S/C20H20ClN3O2/c21-18-14-8-12-16(22-18)19-23-20(26-24-19)17(25)13-7-2-1-4-9-15-10-5-3-6-11-15/h3,5-6,8,10-12,14H,1-2,4,7,9,13H2
1n/an/an/an/an/an/an/an/a
Institute for Chemical Biology
Curated by ChEMBL
Assay Description
Inhibition of rat FAAH expressed in Escherichia coli
J Med Chem 51: 4392-403 (2008)
Article DOI: 10.1021/jm800136b
BindingDB Entry DOI: 10.7270/Q26D5TW3
Sn1-specific diacylglycerol lipase alpha
(Homo sapiens (Human))
BDBM50261941
(1-(3-(6-Chloropyridin-2-yl)-1,2,4-oxadiazol-5-yl)-...)
Show SMILES Clc1cccc(n1)-c1noc(n1)C(=O)CCCCCCc1ccccc1
Show InChI InChI=1S/C20H20ClN3O2/c21-18-14-8-12-16(22-18)19-23-20(26-24-19)17(25)13-7-2-1-4-9-15-10-5-3-6-11-15/h3,5-6,8,10-12,14H,1-2,4,7,9,13H2
NCI pathway
Reactome pathway
n/an/a<1.00E+4n/an/an/an/an/an/a
Leiden University
Curated by ChEMBL
Assay Description
Inhibition of full-length human DAGLalpha expressed in HEK293T cell membranes using para-nitrophenylbutyrate by colorimetric assay
J Med Chem 58: 9742-53 (2015)
Article DOI: 10.1021/acs.jmedchem.5b01627
BindingDB Entry DOI: 10.7270/Q2D50QZ9