BDBM50261945 CHEMBL4088331
SMILES: C[C@](C1CC1)(c1noc(n1)-c1cnn(c1)C1COC1)c1ccc(nc1)-c1cnc(N)nc1
InChI Key: InChIKey=YLRZEBDQTLQUQM-JOCHJYFZSA-N
Data: 2 IC50
Activity Spreadsheet -- Enzyme Inhibition Constant Data from BindingDB
Found 2 hits for monomerid = 50261945
Trg + Lig
Ki
nM
ΔG°
kcal/mole
IC50
nM
Kd
nM
EC50/IC50
nM
koff
s-1
kon
M-1s-1
pHTemp
°C
5-lipoxygenase/FLAP
(Homo sapiens (Human))
BDBM50261945
(CHEMBL4088331)
Show SMILES C[C@](C1CC1)(c1noc(n1)-c1cnn(c1)C1COC1)c1ccc(nc1)-c1cnc(N)nc1 |r|
Show InChI InChI=1S/C22H22N8O2/c1-22(15-2-3-15,16-4-5-18(24-9-16)13-6-25-21(23)26-7-13)20-28-19(32-29-20)14-8-27-30(10-14)17-11-31-12-17/h4-10,15,17H,2-3,11-12H2,1H3,(H2,23,25,26)/t22-/m1/s1
Reactome pathway
n/an/a 12n/an/an/an/an/an/a
Small Molecule Discovery Research, Boehringer Ingelheim Pharmaceuticals, Inc., 900 Ridgebury Road, P.O. Box 368, Ridgefield, CT 06877-0368, USA. Electronic address: abartolozzi@gmail.com.
Curated by ChEMBL
Assay Description
Inhibition of FLAP in calcimycin-stimulated human whole blood assessed as reduction in LTB4 production pretreated for 15 mins followed by calcimycin ...
Bioorg Med Chem Lett 27: 4652-4659 (2017)
Article DOI: 10.1016/j.bmcl.2017.09.007
BindingDB Entry DOI: 10.7270/Q2HQ42CS
5-lipoxygenase/FLAP
(Homo sapiens (Human))
BDBM50261945
(CHEMBL4088331)
Show SMILES C[C@](C1CC1)(c1noc(n1)-c1cnn(c1)C1COC1)c1ccc(nc1)-c1cnc(N)nc1 |r|
Show InChI InChI=1S/C22H22N8O2/c1-22(15-2-3-15,16-4-5-18(24-9-16)13-6-25-21(23)26-7-13)20-28-19(32-29-20)14-8-27-30(10-14)17-11-31-12-17/h4-10,15,17H,2-3,11-12H2,1H3,(H2,23,25,26)/t22-/m1/s1
Reactome pathway
n/an/a 1.5n/an/an/an/an/an/a
Small Molecule Discovery Research, Boehringer Ingelheim Pharmaceuticals, Inc., 900 Ridgebury Road, P.O. Box 368, Ridgefield, CT 06877-0368, USA. Electronic address: abartolozzi@gmail.com.
Curated by ChEMBL
Assay Description
Displacement of [125I]-L-691831 from human FLAP expressed in Sf9 cell membranes after 2 hrs by Topcount method
Bioorg Med Chem Lett 27: 4652-4659 (2017)
Article DOI: 10.1016/j.bmcl.2017.09.007
BindingDB Entry DOI: 10.7270/Q2HQ42CS