BDBM50262000 CHEMBL4071532
SMILES: Nc1ncc(cn1)-c1ccc(cc1)C1(CCC1)c1noc(n1)-c1cnn(c1)C1COC1
InChI Key: InChIKey=NYVSJJYPPQSTBA-UHFFFAOYSA-N
Data: 2 IC50
Activity Spreadsheet -- Enzyme Inhibition Constant Data from BindingDB
Found 2 hits for monomerid = 50262000
Trg + Lig
Ki
nM
ΔG°
kcal/mole
IC50
nM
Kd
nM
EC50/IC50
nM
koff
s-1
kon
M-1s-1
pHTemp
°C
5-lipoxygenase/FLAP
(Homo sapiens (Human))
BDBM50262000
(CHEMBL4071532)
Show SMILES Nc1ncc(cn1)-c1ccc(cc1)C1(CCC1)c1noc(n1)-c1cnn(c1)C1COC1
Show InChI InChI=1S/C22H21N7O2/c23-21-24-8-15(9-25-21)14-2-4-17(5-3-14)22(6-1-7-22)20-27-19(31-28-20)16-10-26-29(11-16)18-12-30-13-18/h2-5,8-11,18H,1,6-7,12-13H2,(H2,23,24,25)
Reactome pathway
n/an/a 1.90n/an/an/an/an/an/a
Small Molecule Discovery Research, Boehringer Ingelheim Pharmaceuticals, Inc., 900 Ridgebury Road, P.O. Box 368, Ridgefield, CT 06877-0368, USA. Electronic address: abartolozzi@gmail.com.
Curated by ChEMBL
Assay Description
Displacement of [125I]-L-691831 from human FLAP expressed in Sf9 cell membranes after 2 hrs by Topcount method
Bioorg Med Chem Lett 27: 4652-4659 (2017)
Article DOI: 10.1016/j.bmcl.2017.09.007
BindingDB Entry DOI: 10.7270/Q2HQ42CS
5-lipoxygenase/FLAP
(Homo sapiens (Human))
BDBM50262000
(CHEMBL4071532)
Show SMILES Nc1ncc(cn1)-c1ccc(cc1)C1(CCC1)c1noc(n1)-c1cnn(c1)C1COC1
Show InChI InChI=1S/C22H21N7O2/c23-21-24-8-15(9-25-21)14-2-4-17(5-3-14)22(6-1-7-22)20-27-19(31-28-20)16-10-26-29(11-16)18-12-30-13-18/h2-5,8-11,18H,1,6-7,12-13H2,(H2,23,24,25)
Reactome pathway
n/an/a 43n/an/an/an/an/an/a
Small Molecule Discovery Research, Boehringer Ingelheim Pharmaceuticals, Inc., 900 Ridgebury Road, P.O. Box 368, Ridgefield, CT 06877-0368, USA. Electronic address: abartolozzi@gmail.com.
Curated by ChEMBL
Assay Description
Inhibition of FLAP in calcimycin-stimulated human whole blood assessed as reduction in LTB4 production pretreated for 15 mins followed by calcimycin ...
Bioorg Med Chem Lett 27: 4652-4659 (2017)
Article DOI: 10.1016/j.bmcl.2017.09.007
BindingDB Entry DOI: 10.7270/Q2HQ42CS