null
SMILES: O=C(c1c[nH]c2ccccc12)c1ccccc1NCc1ccc2[nH]ncc2c1
InChI Key: InChIKey=KBOVRIYNPJDICO-UHFFFAOYSA-N
Activity Spreadsheet -- Enzyme Inhibition Constant Data from BindingDB
Found 2 hits for monomerid = 50262056
Trg + Lig
Ki
nM
ΔG°
kcal/mole
IC50
nM
Kd
nM
EC50/IC50
nM
koff
s-1
kon
M-1s-1
pHTemp
°C
Vascular endothelial growth factor receptor 2
(Homo sapiens (Human))
BDBM50262056
((2-((1H-indazol-5-yl)methylamino)phenyl)(1H-indol-...)
Show SMILES O=C(c1c[nH]c2ccccc12)c1ccccc1NCc1ccc2[nH]ncc2c1
Show InChI InChI=1S/C23H18N4O/c28-23(19-14-25-21-7-3-1-5-17(19)21)18-6-2-4-8-22(18)24-12-15-9-10-20-16(11-15)13-26-27-20/h1-11,13-14,24-25H,12H2,(H,26,27)
NCI pathway
Reactome pathway
n/an/a 240n/an/an/an/an/an/a
ImClone Systems Inc
Curated by ChEMBL
Assay Description
Inhibition of KDR (unknown origin) autophosphorylation by cell based assay
Bioorg Med Chem Lett 18: 4344-7 (2008)
Article DOI: 10.1016/j.bmcl.2008.06.083
BindingDB Entry DOI: 10.7270/Q2542NF0
Vascular endothelial growth factor receptor 2
(Homo sapiens (Human))
BDBM50262056
((2-((1H-indazol-5-yl)methylamino)phenyl)(1H-indol-...)
Show SMILES O=C(c1c[nH]c2ccccc12)c1ccccc1NCc1ccc2[nH]ncc2c1
Show InChI InChI=1S/C23H18N4O/c28-23(19-14-25-21-7-3-1-5-17(19)21)18-6-2-4-8-22(18)24-12-15-9-10-20-16(11-15)13-26-27-20/h1-11,13-14,24-25H,12H2,(H,26,27)
NCI pathway
Reactome pathway
n/an/a 610n/an/an/an/an/an/a
ImClone Systems Inc
Curated by ChEMBL
Assay Description
Inhibition of KDR (unknown origin) by HTRF assay
Bioorg Med Chem Lett 18: 4344-7 (2008)
Article DOI: 10.1016/j.bmcl.2008.06.083
BindingDB Entry DOI: 10.7270/Q2542NF0