null
SMILES: C1CN(CCN1)c1ccc(cc1)-c1ccc2c(cnn2c1)-c1ccnc2ccccc12
InChI Key: InChIKey=HMVOWZJWAKWRRX-UHFFFAOYSA-N
Activity Spreadsheet -- Enzyme Inhibition Constant Data from BindingDB
Found 1 hit for monomerid = 50262178
Trg + Lig
Ki
nM
ΔG°
kcal/mole
IC50
nM
Kd
nM
EC50/IC50
nM
koff
s-1
kon
M-1s-1
pHTemp
°C
Bone morphogenetic protein 4
(Homo sapiens (Human))
BDBM50262178
(4-(6-(4-(piperazin-1-yl)phenyl)H-pyrazolo[1,5-a]py...)
Show SMILES C1CN(CCN1)c1ccc(cc1)-c1ccc2c(cnn2c1)-c1ccnc2ccccc12
Show InChI InChI=1S/C26H23N5/c1-2-4-25-23(3-1)22(11-12-28-25)24-17-29-31-18-20(7-10-26(24)31)19-5-8-21(9-6-19)30-15-13-27-14-16-30/h1-12,17-18,27H,13-16H2
NCI pathway
Reactome pathway
n/an/a 5n/an/an/an/an/an/a
Harvard Medical School
Curated by ChEMBL
Assay Description
Inhibition of BMP4 (unknown origin)-induced phosphorylation of SMAD 1/5/8 by cytoblot cellular ELISA
Bioorg Med Chem Lett 18: 4388-92 (2008)
Article DOI: 10.1016/j.bmcl.2008.06.052
BindingDB Entry DOI: 10.7270/Q2BR8S0V