BDBM50262186 7-Phenyl-1-(5-(thien-2-yl)-1,3,4-oxadiazol-2-yl)-heptan-1-one::CHEMBL467816
SMILES: O=C(CCCCCCc1ccccc1)c1nnc(o1)-c1cccs1
InChI Key: InChIKey=LNGGGIGILNPUHI-UHFFFAOYSA-N
Data: 1 KI  1 IC50
Activity Spreadsheet -- Enzyme Inhibition Constant Data from BindingDB
Found 2 hits for monomerid = 50262186
Trg + Lig
Ki
nM
ΔG°
kcal/mole
IC50
nM
Kd
nM
EC50/IC50
nM
koff
s-1
kon
M-1s-1
pHTemp
°C
Fatty-acid amide hydrolase 1 (aa 30-579)
(Rattus norvegicus (rat))
BDBM50262186
(7-Phenyl-1-(5-(thien-2-yl)-1,3,4-oxadiazol-2-yl)-h...)
Show SMILES O=C(CCCCCCc1ccccc1)c1nnc(o1)-c1cccs1
Show InChI InChI=1S/C19H20N2O2S/c22-16(18-20-21-19(23-18)17-13-8-14-24-17)12-7-2-1-4-9-15-10-5-3-6-11-15/h3,5-6,8,10-11,13-14H,1-2,4,7,9,12H2
0.800n/an/an/an/an/an/a9.0n/a
Institute for Chemical Biology
Curated by ChEMBL
Assay Description
Inhibition of rat FAAH expressed in Escherichia coli at pH 9.0
J Med Chem 51: 4392-403 (2008)
Article DOI: 10.1021/jm800136b
BindingDB Entry DOI: 10.7270/Q26D5TW3
Fatty-acid amide hydrolase 1 (aa 30-579)
(Rattus norvegicus (rat))
BDBM50262186
(7-Phenyl-1-(5-(thien-2-yl)-1,3,4-oxadiazol-2-yl)-h...)
Show SMILES O=C(CCCCCCc1ccccc1)c1nnc(o1)-c1cccs1
Show InChI InChI=1S/C19H20N2O2S/c22-16(18-20-21-19(23-18)17-13-8-14-24-17)12-7-2-1-4-9-15-10-5-3-6-11-15/h3,5-6,8,10-11,13-14H,1-2,4,7,9,12H2
n/an/a 2.50E+3n/an/an/an/an/an/a
Institute for Chemical Biology
Curated by ChEMBL
Assay Description
Inhibition of rat FAAH expressed in Escherichia coli
J Med Chem 51: 4392-403 (2008)
Article DOI: 10.1021/jm800136b
BindingDB Entry DOI: 10.7270/Q26D5TW3